{"text_format":"1","workbook":"xlsx","n_sheets":4,"sheets":["Summary","Data","Settings","config"],"not_rendered":{"charts":5,"images":11,"macros":1,"external_links":1,"defined_names":20,"comments":0,"pivot_tables":0},"unopened":[],"bounds":{"document_bytes":16777216,"sheet_cells":100000,"rows_first":2000,"rows_last":500,"rows_between":2000,"halvings":0,"cell_chars":16384,"cell_head_chars":4096},"cells_cut":0,"cells_raw":0,"read":"whole","date_system":"1900"}

{"sheet":"Summary","index":0,"n_rows":29,"n_cols":14,"rows_kept":29,"cut":false,"hidden":false,"merged":[[2,9,2,13],[3,9,3,13],[4,9,4,13],[13,13,15,13],[17,1,18,5],[11,9,12,13],[13,9,13,10],[14,9,14,10],[15,9,15,10]]}
[null,"Weight Loss Tracker"]
[]
[null,{"$f":"IF(Settings!C3=\"\",\"\",Settings!C3)","v":"Brian"},"Add New Measurements","Starting Measurements","My Progress\nTo Date","My Goals","Remaining",null,null,"My current Body Mass Index (BMI)"]
[null,"Date:","2017-02-15",{"$f":"IF(Settings!C8=\"\",\"\",Settings!C8)","v":"2016-08-13"},{"$f":"IF(Data!A1=0,\"\",Data!A1)","v":"2017-02-08"},{"$f":"IF(Settings!E8=\"\",\"\",Settings!E8)","v":"2017-06-01"},{"$f":"IFERROR(IF(E4=\"\",\"\",IF(H4=\"days\",F4-E4,(F4-E4)/7)),\"\")","v":113},{"$f":"F20","v":"days"},null,{"$f":"IFERROR(IF(Settings!$F$5=\"Metric\",E7/(D6*D6/10000),E7/(D6*D6)*703),0)","v":38.658157639747401}]
[null,"Measurements",null,"% Body weight loss",{"$f":"IF(OR(E7=\"\",D7=0),\"\",(D7-E7)/D7)","v":3.6636136552872539E-2},{"$f":"IFERROR((D7-F7)/D7,\"\")","v":0.29225645295587005},null,null,null,"BMI = weight / (height x height)"]
[null,{"$f":"Settings!B10","v":"Height (cm):"},null,{"$f":"Settings!C10","v":173},null,null,null,null,null,null,"Less than 18.5","Under weight"]
[null,{"$f":"Settings!B11","v":"Weight (kg):"},null,{"$f":"Settings!C11","v":120.1},{"$f":"Data!B1","v":115.7},{"$f":"Settings!E11","v":85},{"$f":"IF(E7=\"\",\"\",F7-E7)","v":-30.700000000000003},{"$f":"IF(Settings!$F$5=\"Imperial\",\"pounds\",\"kg's\")","v":"kg's"},null,null,"18.5 to 24.9","Healthy"]
[null,{"$f":"Settings!B12","v":"Chest (cm):"},null,{"$f":"Settings!C12","v":110},{"$f":"Data!C1","v":127},{"$f":"Settings!E12","v":105},{"$f":"IF(E8=\"\",\"\",F8-E8)","v":-22},{"$f":"IF(Settings!$F$5=\"Imperial\",\"inches\",\"cm's\")","v":"cm's"},null,null,"25 to 29.9","Over weight"]
[null,{"$f":"Settings!B13","v":"Waist (cm):"},null,{"$f":"Settings!C13","v":107},{"$f":"Data!D1","v":134},{"$f":"Settings!E13","v":97},-37,{"$f":"IF(Settings!$F$5=\"Imperial\",\"inches\",\"cm's\")","v":"cm's"},null,null,"30 to 39.9","Obese"]
[null,{"$f":"Settings!B14","v":"Hips (cm):"},null,{"$f":"Settings!C14","v":105},{"$f":"Data!E1","v":134},{"$f":"Settings!E14","v":102},-32,{"$f":"IF(Settings!$F$5=\"Imperial\",\"inches\",\"cm's\")","v":"cm's"},null,null,"40 and over","Morbidly obese"]
[null,{"$f":"Settings!B15","v":"Neck (cm):"},null,{"$f":"Settings!C15","v":42},{"$f":"Data!F1","v":45},{"$f":"Settings!E15","v":36},-9,{"$f":"IF(Settings!$F$5=\"Imperial\",\"inches\",\"cm's\")","v":"cm's"}]
[null,{"$f":"Settings!B16","v":"Thigh (cm):"},null,{"$f":"Settings!C16","v":55},{"$f":"Data!G1","v":65},{"$f":"Settings!E16","v":50},-15,{"$f":"IF(Settings!$F$5=\"Imperial\",\"inches\",\"cm's\")","v":"cm's"},null,"Estimated Lean Body Weight"]
[null,"Blood Pressure"]
[null,{"$f":"Settings!B18","v":"Systolic (mmHg):"},null,{"$f":"Settings!C18","v":146},{"$f":"Data!M1","v":146},{"$f":"Settings!E18","v":115},{"$f":"IF(E14=\"\",\"\",F14-E14)","v":-31},"mmHg",null,"Estimated Lean Body Weight",null,{"$f":"IF(Data!$D$1=0,\"-\",Data!H1)","v":75.87169999999999},{"$f":"H7","v":"kg's"},{"$f":"IF(Data!$D$1=0,\"Please add your waist measurement for these figures to be calculated\",\"\")","v":""}]
[null,{"$f":"Settings!B19","v":"Diastolic (mmHg):"},null,{"$f":"Settings!C19","v":89},{"$f":"Data!N1","v":89},{"$f":"Settings!E19","v":75},{"$f":"IF(E15=\"\",\"\",F15-E15)","v":-14},"mmHg",null,"Estimated Body Fat Weight",null,{"$f":"IF(Data!$D$1=0,\"-\",Data!I1)","v":44.228300000000004},{"$f":"M14","v":"kg's"}]
[null,{"$f":"Settings!B20","v":"Pulse (beats/sec):"},null,{"$f":"Settings!C20","v":84},{"$f":"Data!O1","v":82},{"$f":"Settings!E20","v":65},-17,"beats/sec",null,"Estimated Body Fat Percentage",null,{"$f":"IF(Data!$D$1=0,\"-\",Data!J1)","v":36.826228143213996},"%"]
[]
[null,"How am I progressing?"]
[]
[null,"How long has it been since my initial measurements:",null,null,{"$f":"IF(D4=\"\",\"\",IF(F20=\"days\",TODAY()-$D$4,(TODAY()-$D$4)/7))","v":186},"days"]
[null,"My total weight loss to date:",null,null,{"$f":"IFERROR(Settings!C11-Data!B1,\"\")","v":4.3999999999999915},{"$f":"IF(Settings!$F$5=\"Imperial\",\"pounds\",\"kg's\")","v":"kg's"}]
[null,null,null,null,{"$f":"IFERROR(E21/Settings!C11,\"\")","v":3.6636136552872539E-2},"% Body Weight"]
[null,"My average weight loss to date:",null,null,{"$f":"IFERROR(E21/E20,\"\")","v":2.3655913978494578E-2},{"$f":"IF(Settings!$F$5=\"Imperial\",IF(F20=\"days\",\"pounds per day\",\"pounds per week\"),IF(F20=\"days\",\"kg's per day\",\"kg's per week\"))","v":"kg's per day"}]
[null,"My average weight loss required to meet my goal is:",null,null,{"$f":"IFERROR(G7/G4*-1,\"\")","v":0.27168141592920358},{"$f":"IF(Settings!$F$5=\"Imperial\",IF(F20=\"days\",\"pounds per day\",\"pounds per week\"),IF(F20=\"days\",\"kg's per day\",\"kg's per week\"))","v":"kg's per day"}]
[null,"My % body weight loss goal:",null,null,{"$f":"IFERROR(F5,\"\")","v":0.29225645295587005},"%"]
[null,"At my current rate of weight loss I will:"]
[null,{"$f":"IFERROR(\"- Lose a total of \"&TEXT(E23*G4,\"0.00\")&IF(Settings!$F$5=\"Imperial\",\" pounds\",\" kg's\")&\" at my goal date (my goal weight loss is: \"&TEXT(D7-F7,\"0.00\")&IF(Settings!$F$5=\"Imperial\",\" pounds\",\" kg's\")&\".)\",\"\")","v":"- Lose a total of 2.67 kg's at my goal date (my goal weight loss is: 35.10 kg's.)"}]
[null,{"$f":"IFERROR(\"- My weight at my goal date will be: \"&TEXT($D$7-(E23*G4),\"0.00\")&IF(Settings!$F$5=\"Imperial\",\" pounds\",\" kg's\")&\" (my goal weight is: \"&TEXT(F7,\"0.00\")&IF(Settings!$F$5=\"Imperial\",\" pounds\",\" kg's\")&\".)\",\"\")","v":"- My weight at my goal date will be: 117.43 kg's (my goal weight is: 85.00 kg's.)"}]
[null,{"$f":"IFERROR(\"- meaning I will have lost \"&TEXT((1-(($D$7-(E23*G4))/$D$7)),\"0.00%\")&\" of my starting body weight (my goal % weight loss is: \"&TEXT(F5,\"0.00%\")&\".)\",\"\")","v":"- meaning I will have lost 2.23% of my starting body weight (my goal % weight loss is: 29.23%.)"}]

{"sheet":"Data","index":1,"n_rows":6,"n_cols":17,"rows_kept":6,"cut":false,"hidden":false,"merged":[]}
[{"$f":"MAX(data[Date])","v":"2017-02-08"},{"$f":"IFERROR(LOOKUP(2,1/(NOT(ISBLANK(data[Weight]))),data[Weight]),0)","v":115.7},{"$f":"IFERROR(LOOKUP(2,1/(NOT(ISBLANK(data[Chest]))),data[Chest]),0)","v":127},{"$f":"IFERROR(LOOKUP(2,1/(NOT(ISBLANK(data[Waist]))),data[Waist]),0)","v":134},{"$f":"IFERROR(LOOKUP(2,1/(NOT(ISBLANK(data[Hips]))),data[Hips]),0)","v":134},{"$f":"IFERROR(LOOKUP(2,1/(NOT(ISBLANK(data[Neck]))),data[Neck]),0)","v":45},{"$f":"IFERROR(LOOKUP(2,1/(NOT(ISBLANK(data[Thigh]))),data[Thigh]),0)","v":65},{"$f":"VLOOKUP($D1,data[[Waist]:[Goal Weight (kg)]],COLUMNS($D$4:H6),FALSE)","v":75.87169999999999},{"$f":"VLOOKUP($D1,data[[Waist]:[Goal Weight (kg)]],COLUMNS($D$4:I6),FALSE)","v":44.228300000000004},{"$f":"VLOOKUP($D1,data[[Waist]:[Goal Weight (kg)]],COLUMNS($D$4:J6),FALSE)","v":36.826228143213996},{"$f":"VLOOKUP($B1,data[[Weight]:[Goal Weight (kg)]],COLUMNS($B$4:K6),FALSE)","v":38.658157639747401},{"$f":"VLOOKUP($B1,data[[Weight]:[Goal Weight (kg)]],COLUMNS($B$4:L6),FALSE)","v":85},{"$f":"IFERROR(LOOKUP(2,1/(NOT(ISBLANK(data[Systolic (mmHg)]))),data[Systolic (mmHg)]),0)","v":146},{"$f":"IFERROR(LOOKUP(2,1/(NOT(ISBLANK(data[Diastolic (mmHg)]))),data[Diastolic (mmHg)]),0)","v":89},{"$f":"IFERROR(LOOKUP(2,1/(NOT(ISBLANK(data[Pulse (beats/sec)]))),data[Pulse (beats/sec)]),0)","v":82}]
[null,"My Data"]
["Date","Weight","Chest","Waist","Hips","Neck","Thigh","Estimated Lean Body Weight","Estimated Body Fat Weight","Estimated Body Fat Percentage","Estimated Body Mass Index (BMI)","Goal Weight (kg)","Systolic (mmHg)","Diastolic (mmHg)","Pulse (beats/sec)"]
["2016-08-13",120.1,127,134,134,45,65,{"$f":"IF(B4=\"\",0,IF(Settings!$F$5=\"Metric\",IF(Settings!$F$3=\"Male\",B4*0.407+Settings!$C$10*0.267-19.2,B4*0.252+Settings!$C$10*0.473-48.3),IF(Settings!$F$3=\"Male\",B4*0.45359237*0.407+Settings!$C$10*2.54*0.267-19.2,B4*0.45359237*0.252+Settings!$C$10*2.54*0.473-48.3)))","v":75.87169999999999},{"$f":"IF(OR(B4=\"\",H4=0),0,B4-H4)","v":44.228300000000004},{"$f":"IF(I4=0,0,(I4*100)/B4)","v":36.826228143213996},{"$f":"B4/(Summary!$D$6^2/10000)","v":40.128303651976339},{"$f":"Summary!$F$7","v":85},146,89,84,null,"DO NOT Delete this row"]
["2016-09-02",118.3,null,null,null,null,null,{"$f":"IF(B5=\"\",0,IF(Settings!$F$5=\"Metric\",IF(Settings!$F$3=\"Male\",B5*0.407+Settings!$C$10*0.267-19.2,B5*0.252+Settings!$C$10*0.473-48.3),IF(Settings!$F$3=\"Male\",B5*0.45359237*0.407+Settings!$C$10*2.54*0.267-19.2,B5*0.45359237*0.252+Settings!$C$10*2.54*0.473-48.3)))","v":75.139099999999999},{"$f":"IF(OR(B5=\"\",H5=0),0,B5-H5)","v":43.160899999999998},{"$f":"IF(I5=0,0,(I5*100)/B5)","v":36.48427726120034},{"$f":"B5/(Summary!$D$6^2/10000)","v":39.526880283337228},{"$f":"Summary!$F$7","v":85},146,89,82]
["2017-02-08",115.7,null,null,null,null,null,{"$f":"IF(B6=\"\",0,IF(Settings!$F$5=\"Metric\",IF(Settings!$F$3=\"Male\",B6*0.407+Settings!$C$10*0.267-19.2,B6*0.252+Settings!$C$10*0.473-48.3),IF(Settings!$F$3=\"Male\",B6*0.45359237*0.407+Settings!$C$10*2.54*0.267-19.2,B6*0.45359237*0.252+Settings!$C$10*2.54*0.473-48.3)))","v":74.0809},{"$f":"IF(OR(B6=\"\",H6=0),0,B6-H6)","v":41.619100000000003},{"$f":"IF(I6=0,0,(I6*100)/B6)","v":35.971564390665513},{"$f":"B6/(Summary!$D$6^2/10000)","v":38.658157639747401},{"$f":"Summary!$F$7","v":85}]

{"sheet":"Settings","index":2,"n_rows":20,"n_cols":7,"rows_kept":20,"cut":false,"hidden":false,"merged":[[2,5,2,6],[4,5,4,6],[6,1,6,2]]}
[null,"Settings"]
[]
[null,"Name:","Brian",null,"Sex:","Male"]
[]
[null,"Date of Birth:","1969-10-14",null,"Measurements:","Metric"]
[]
[null,"Starting Measurements",null,null,"My Goal Measurements",null,"To Meet\nMy Goal"]
[null,"Date:","2016-08-13",null,"2017-06-01",null,{"$f":"IF(OR(C8=\"\",E8=\"\"),\"\",E8-C8)","v":292}]
[null,null,"Measurements"]
[null,{"$f":"IF($F$5=\"Imperial\",\"Height (inches):\",\"Height (cm):\")","v":"Height (cm):"},173]
[null,{"$f":"IF($F$5=\"Imperial\",\"Weight (pounds):\",\"Weight (kg):\")","v":"Weight (kg):"},120.1,null,85,null,{"$f":"IF(C11=\"\",\"\",E11-C11)","v":-35.099999999999994}]
[null,{"$f":"IF($F$5=\"Imperial\",\"Chest (inches):\",\"Chest (cm):\")","v":"Chest (cm):"},110,null,105,null,{"$f":"IF(C12=\"\",\"\",E12-C12)","v":-5}]
[null,{"$f":"IF($F$5=\"Imperial\",\"Waist (inches):\",\"Waist (cm):\")","v":"Waist (cm):"},107,null,97,null,-10]
[null,{"$f":"IF($F$5=\"Imperial\",\"Hips (inches):\",\"Hips (cm):\")","v":"Hips (cm):"},105,null,102,null,-3]
[null,{"$f":"IF($F$5=\"Imperial\",\"Neck (inches):\",\"Neck (cm):\")","v":"Neck (cm):"},42,null,36,null,-6]
[null,{"$f":"IF($F$5=\"Imperial\",\"Thigh (inches):\",\"Thigh (cm):\")","v":"Thigh (cm):"},55,null,50,null,-5]
[null,null,"Blood Pressure"]
[null,"Systolic (mmHg):",146,null,115,null,-31]
[null,"Diastolic (mmHg):",89,null,75,null,-14]
[null,"Pulse (beats/sec):",84,null,65,null,-19]

{"sheet":"config","index":3,"n_rows":493,"n_cols":30,"rows_kept":493,"cut":false,"hidden":true,"merged":[]}
[null,"Configuration settings"]
[]
[null,null,null,null,null,null,"Dashboard Graph Data",null,null,null,null,null,null,null,null,null,null,null,null,null,null,null,null,null,null,null,null,{"$f":"Data!M1","v":146},{"$f":"Data!N1","v":89}]
[null,null,null,null,null,null,null,"Date","Weight Loss Goal","Actual Weight Loss ","Goal Weight (kg)",null,{"$f":"IF(Settings!$F$5=\"Metric\",\"cm\",\"inch\")","v":"cm"},18.5,25,30,40,"40+","My BMI","BMI Label",null,"Blood Pressure","Low","Normal","PreHypertension","High Stage 1","High Stage 2","Hypertensive Crisis","My BP","BP Label"]
[null,"Sex",null,"Time",null,null,0,{"$f":"Settings!C8","v":"2016-08-13"},{"$f":"Settings!C11","v":120.1},{"$f":"Settings!C11","v":120.1},{"$f":"Settings!E11","v":85},null,{"$f":"IF(Settings!$F$5=\"Metric\",140,55)","v":140},{"$f":"IF(Settings!$F$5=\"Metric\",N$4*$M5*$M5/10000,N$4*$M5*$M5/703)","v":36.26},{"$f":"IF(Settings!$F$5=\"Metric\",O$4*$M5*$M5/10000,O$4*$M5*$M5/703)","v":49},{"$f":"IF(Settings!$F$5=\"Metric\",P$4*$M5*$M5/10000,P$4*$M5*$M5/703)","v":58.8},{"$f":"IF(Settings!$F$5=\"Metric\",Q$4*$M5*$M5/10000,Q$4*$M5*$M5/703)","v":78.400000000000006},{"$f":"Q40+10","v":186.4},{"$f":"IF(AND(Settings!$C$10>=config!M5,Settings!$C$10<config!M6),Data!$B$1,NA())","v":{"$error":"#N/A"}},{"$f":"IF(ISERROR(S5),NA(),\"My current BMI: \"&TEXT(Summary!$J$4,\"0.0\"))","v":{"$error":"#N/A"}},null,40,90,120,140,160,180,200,{"$f":"IF(AND($AC$3>=config!V5,$AC$3<config!V6),$AB$3,NA())","v":{"$error":"#N/A"}},{"$f":"IF(ISERROR(AC5),NA(),\"My current BP: \"&TEXT($AB$3,\"0\")&\"/\"&TEXT($AC$3,\"0\"))","v":{"$error":"#N/A"}}]
[null,"Male",null,"days",null,null,{"$f":"G5+1","v":1},{"$f":"H5+1","v":"2016-08-14"},{"$f":"Settings!$C$11-((Settings!$C$11-Settings!$E$11)/(Settings!$E$8-Settings!$C$8)*$G6)","v":119.97979452054794},{"$f":"VLOOKUP(H6,data[],2,FALSE)","v":{"$error":"#N/A"}},{"$f":"VLOOKUP(H6,data[],12,FALSE)","v":{"$error":"#N/A"}},null,{"$f":"IF(Settings!$F$5=\"Metric\",M5+2,M5+1)","v":142},{"$f":"IF(Settings!$F$5=\"Metric\",N$4*$M6*$M6/10000,N$4*$M6*$M6/703)","v":37.303400000000003},{"$f":"IF(Settings!$F$5=\"Metric\",O$4*$M6*$M6/10000,O$4*$M6*$M6/703)","v":50.41},{"$f":"IF(Settings!$F$5=\"Metric\",P$4*$M6*$M6/10000,P$4*$M6*$M6/703)","v":60.491999999999997},{"$f":"IF(Settings!$F$5=\"Metric\",Q$4*$M6*$M6/10000,Q$4*$M6*$M6/703)","v":80.656000000000006},{"$f":"R5","v":186.4},{"$f":"IF(AND(Settings!$C$10>=config!M6,Settings!$C$10<config!M7),Data!$B$1,NA())","v":{"$error":"#N/A"}},{"$f":"IF(ISERROR(S6),NA(),\"My current BMI: \"&TEXT(Summary!$J$4,\"0.0\"))","v":{"$error":"#N/A"}},null,{"$f":"V5+1","v":41},90,120,140,160,180,200,{"$f":"IF(AND($AC$3>=config!V6,$AC$3<config!V7),$AB$3,NA())","v":{"$error":"#N/A"}},{"$f":"IF(ISERROR(AC6),NA(),\"My current BP: \"&TEXT($AB$3,\"0\")&\"/\"&TEXT($AC$3,\"0\"))","v":{"$error":"#N/A"}}]
[null,"Female",null,"weeks",null,null,2,"2016-08-15",{"$f":"Settings!$C$11-((Settings!$C$11-Settings!$E$11)/(Settings!$E$8-Settings!$C$8)*$G7)","v":119.85958904109589},{"$f":"VLOOKUP(H7,data[],2,FALSE)","v":{"$error":"#N/A"}},{"$f":"VLOOKUP(H7,data[],12,FALSE)","v":{"$error":"#N/A"}},null,{"$f":"IF(Settings!$F$5=\"Metric\",M6+2,M6+1)","v":144},{"$f":"IF(Settings!$F$5=\"Metric\",N$4*$M7*$M7/10000,N$4*$M7*$M7/703)","v":38.361600000000003},{"$f":"IF(Settings!$F$5=\"Metric\",O$4*$M7*$M7/10000,O$4*$M7*$M7/703)","v":51.84},{"$f":"IF(Settings!$F$5=\"Metric\",P$4*$M7*$M7/10000,P$4*$M7*$M7/703)","v":62.207999999999998},{"$f":"IF(Settings!$F$5=\"Metric\",Q$4*$M7*$M7/10000,Q$4*$M7*$M7/703)","v":82.944000000000003},{"$f":"R6","v":186.4},{"$f":"IF(AND(Settings!$C$10>=config!M7,Settings!$C$10<config!M8),Data!$B$1,NA())","v":{"$error":"#N/A"}},{"$f":"IF(ISERROR(S7),NA(),\"My current BMI: \"&TEXT(Summary!$J$4,\"0.0\"))","v":{"$error":"#N/A"}},null,{"$f":"V6+1","v":42},90,120,140,160,180,200,{"$f":"IF(AND($AC$3>=config!V7,$AC$3<config!V8),$AB$3,NA())","v":{"$error":"#N/A"}},{"$error":"#N/A"}]
[null,null,null,null,null,null,3,"2016-08-16",{"$f":"Settings!$C$11-((Settings!$C$11-Settings!$E$11)/(Settings!$E$8-Settings!$C$8)*$G8)","v":119.73938356164383},{"$f":"VLOOKUP(H8,data[],2,FALSE)","v":{"$error":"#N/A"}},{"$f":"VLOOKUP(H8,data[],12,FALSE)","v":{"$error":"#N/A"}},null,{"$f":"IF(Settings!$F$5=\"Metric\",M7+2,M7+1)","v":146},{"$f":"IF(Settings!$F$5=\"Metric\",N$4*$M8*$M8/10000,N$4*$M8*$M8/703)","v":39.434600000000003},{"$f":"IF(Settings!$F$5=\"Metric\",O$4*$M8*$M8/10000,O$4*$M8*$M8/703)","v":53.29},{"$f":"IF(Settings!$F$5=\"Metric\",P$4*$M8*$M8/10000,P$4*$M8*$M8/703)","v":63.948},{"$f":"IF(Settings!$F$5=\"Metric\",Q$4*$M8*$M8/10000,Q$4*$M8*$M8/703)","v":85.263999999999996},186.4,{"$f":"IF(AND(Settings!$C$10>=config!M8,Settings!$C$10<config!M9),Data!$B$1,NA())","v":{"$error":"#N/A"}},{"$f":"IF(ISERROR(S8),NA(),\"My current BMI: \"&TEXT(Summary!$J$4,\"0.0\"))","v":{"$error":"#N/A"}},null,43,90,120,140,160,180,200,{"$f":"IF(AND($AC$3>=config!V8,$AC$3<config!V9),$AB$3,NA())","v":{"$error":"#N/A"}},{"$error":"#N/A"}]
[null,"Measurements",null,null,null,null,4,"2016-08-17",{"$f":"Settings!$C$11-((Settings!$C$11-Settings!$E$11)/(Settings!$E$8-Settings!$C$8)*$G9)","v":119.61917808219178},{"$f":"VLOOKUP(H9,data[],2,FALSE)","v":{"$error":"#N/A"}},{"$f":"VLOOKUP(H9,data[],12,FALSE)","v":{"$error":"#N/A"}},null,{"$f":"IF(Settings!$F$5=\"Metric\",M8+2,M8+1)","v":148},{"$f":"IF(Settings!$F$5=\"Metric\",N$4*$M9*$M9/10000,N$4*$M9*$M9/703)","v":40.522399999999998},{"$f":"IF(Settings!$F$5=\"Metric\",O$4*$M9*$M9/10000,O$4*$M9*$M9/703)","v":54.76},{"$f":"IF(Settings!$F$5=\"Metric\",P$4*$M9*$M9/10000,P$4*$M9*$M9/703)","v":65.712000000000003},{"$f":"IF(Settings!$F$5=\"Metric\",Q$4*$M9*$M9/10000,Q$4*$M9*$M9/703)","v":87.616},186.4,{"$f":"IF(AND(Settings!$C$10>=config!M9,Settings!$C$10<config!M10),Data!$B$1,NA())","v":{"$error":"#N/A"}},{"$f":"IF(ISERROR(S9),NA(),\"My current BMI: \"&TEXT(Summary!$J$4,\"0.0\"))","v":{"$error":"#N/A"}},null,44,90,120,140,160,180,200,{"$f":"IF(AND($AC$3>=config!V9,$AC$3<config!V10),$AB$3,NA())","v":{"$error":"#N/A"}},{"$error":"#N/A"}]
[null,"Metric",null,null,null,null,5,"2016-08-18",{"$f":"Settings!$C$11-((Settings!$C$11-Settings!$E$11)/(Settings!$E$8-Settings!$C$8)*$G10)","v":119.49897260273973},{"$f":"VLOOKUP(H10,data[],2,FALSE)","v":{"$error":"#N/A"}},{"$f":"VLOOKUP(H10,data[],12,FALSE)","v":{"$error":"#N/A"}},null,{"$f":"IF(Settings!$F$5=\"Metric\",M9+2,M9+1)","v":150},{"$f":"IF(Settings!$F$5=\"Metric\",N$4*$M10*$M10/10000,N$4*$M10*$M10/703)","v":41.625},{"$f":"IF(Settings!$F$5=\"Metric\",O$4*$M10*$M10/10000,O$4*$M10*$M10/703)","v":56.25},{"$f":"IF(Settings!$F$5=\"Metric\",P$4*$M10*$M10/10000,P$4*$M10*$M10/703)","v":67.5},{"$f":"IF(Settings!$F$5=\"Metric\",Q$4*$M10*$M10/10000,Q$4*$M10*$M10/703)","v":90},186.4,{"$f":"IF(AND(Settings!$C$10>=config!M10,Settings!$C$10<config!M11),Data!$B$1,NA())","v":{"$error":"#N/A"}},{"$f":"IF(ISERROR(S10),NA(),\"My current BMI: \"&TEXT(Summary!$J$4,\"0.0\"))","v":{"$error":"#N/A"}},null,45,90,120,140,160,180,200,{"$f":"IF(AND($AC$3>=config!V10,$AC$3<config!V11),$AB$3,NA())","v":{"$error":"#N/A"}},{"$error":"#N/A"}]
[null,"Imperial",null,null,null,null,6,"2016-08-19",{"$f":"Settings!$C$11-((Settings!$C$11-Settings!$E$11)/(Settings!$E$8-Settings!$C$8)*$G11)","v":119.37876712328766},{"$f":"VLOOKUP(H11,data[],2,FALSE)","v":{"$error":"#N/A"}},{"$f":"VLOOKUP(H11,data[],12,FALSE)","v":{"$error":"#N/A"}},null,{"$f":"IF(Settings!$F$5=\"Metric\",M10+2,M10+1)","v":152},{"$f":"IF(Settings!$F$5=\"Metric\",N$4*$M11*$M11/10000,N$4*$M11*$M11/703)","v":42.742400000000004},{"$f":"IF(Settings!$F$5=\"Metric\",O$4*$M11*$M11/10000,O$4*$M11*$M11/703)","v":57.76},{"$f":"IF(Settings!$F$5=\"Metric\",P$4*$M11*$M11/10000,P$4*$M11*$M11/703)","v":69.311999999999998},{"$f":"IF(Settings!$F$5=\"Metric\",Q$4*$M11*$M11/10000,Q$4*$M11*$M11/703)","v":92.415999999999997},186.4,{"$f":"IF(AND(Settings!$C$10>=config!M11,Settings!$C$10<config!M12),Data!$B$1,NA())","v":{"$error":"#N/A"}},{"$f":"IF(ISERROR(S11),NA(),\"My current BMI: \"&TEXT(Summary!$J$4,\"0.0\"))","v":{"$error":"#N/A"}},null,46,90,120,140,160,180,200,{"$f":"IF(AND($AC$3>=config!V11,$AC$3<config!V12),$AB$3,NA())","v":{"$error":"#N/A"}},{"$error":"#N/A"}]
[null,null,null,null,null,null,7,"2016-08-20",{"$f":"Settings!$C$11-((Settings!$C$11-Settings!$E$11)/(Settings!$E$8-Settings!$C$8)*$G12)","v":119.25856164383561},{"$f":"VLOOKUP(H12,data[],2,FALSE)","v":{"$error":"#N/A"}},{"$f":"VLOOKUP(H12,data[],12,FALSE)","v":{"$error":"#N/A"}},null,{"$f":"IF(Settings!$F$5=\"Metric\",M11+2,M11+1)","v":154},{"$f":"IF(Settings!$F$5=\"Metric\",N$4*$M12*$M12/10000,N$4*$M12*$M12/703)","v":43.874600000000001},{"$f":"IF(Settings!$F$5=\"Metric\",O$4*$M12*$M12/10000,O$4*$M12*$M12/703)","v":59.29},{"$f":"IF(Settings!$F$5=\"Metric\",P$4*$M12*$M12/10000,P$4*$M12*$M12/703)","v":71.147999999999996},{"$f":"IF(Settings!$F$5=\"Metric\",Q$4*$M12*$M12/10000,Q$4*$M12*$M12/703)","v":94.864000000000004},186.4,{"$f":"IF(AND(Settings!$C$10>=config!M12,Settings!$C$10<config!M13),Data!$B$1,NA())","v":{"$error":"#N/A"}},{"$f":"IF(ISERROR(S12),NA(),\"My current BMI: \"&TEXT(Summary!$J$4,\"0.0\"))","v":{"$error":"#N/A"}},null,47,90,120,140,160,180,200,{"$f":"IF(AND($AC$3>=config!V12,$AC$3<config!V13),$AB$3,NA())","v":{"$error":"#N/A"}},{"$error":"#N/A"}]
[null,null,null,null,null,null,8,"2016-08-21",{"$f":"Settings!$C$11-((Settings!$C$11-Settings!$E$11)/(Settings!$E$8-Settings!$C$8)*$G13)","v":119.13835616438355},{"$f":"VLOOKUP(H13,data[],2,FALSE)","v":{"$error":"#N/A"}},{"$f":"VLOOKUP(H13,data[],12,FALSE)","v":{"$error":"#N/A"}},null,{"$f":"IF(Settings!$F$5=\"Metric\",M12+2,M12+1)","v":156},{"$f":"IF(Settings!$F$5=\"Metric\",N$4*$M13*$M13/10000,N$4*$M13*$M13/703)","v":45.021599999999999},{"$f":"IF(Settings!$F$5=\"Metric\",O$4*$M13*$M13/10000,O$4*$M13*$M13/703)","v":60.84},{"$f":"IF(Settings!$F$5=\"Metric\",P$4*$M13*$M13/10000,P$4*$M13*$M13/703)","v":73.007999999999996},{"$f":"IF(Settings!$F$5=\"Metric\",Q$4*$M13*$M13/10000,Q$4*$M13*$M13/703)","v":97.343999999999994},186.4,{"$f":"IF(AND(Settings!$C$10>=config!M13,Settings!$C$10<config!M14),Data!$B$1,NA())","v":{"$error":"#N/A"}},{"$f":"IF(ISERROR(S13),NA(),\"My current BMI: \"&TEXT(Summary!$J$4,\"0.0\"))","v":{"$error":"#N/A"}},null,48,90,120,140,160,180,200,{"$f":"IF(AND($AC$3>=config!V13,$AC$3<config!V14),$AB$3,NA())","v":{"$error":"#N/A"}},{"$error":"#N/A"}]
[null,null,null,null,null,null,9,"2016-08-22",{"$f":"Settings!$C$11-((Settings!$C$11-Settings!$E$11)/(Settings!$E$8-Settings!$C$8)*$G14)","v":119.0181506849315},{"$f":"VLOOKUP(H14,data[],2,FALSE)","v":{"$error":"#N/A"}},{"$f":"VLOOKUP(H14,data[],12,FALSE)","v":{"$error":"#N/A"}},null,{"$f":"IF(Settings!$F$5=\"Metric\",M13+2,M13+1)","v":158},{"$f":"IF(Settings!$F$5=\"Metric\",N$4*$M14*$M14/10000,N$4*$M14*$M14/703)","v":46.183399999999999},{"$f":"IF(Settings!$F$5=\"Metric\",O$4*$M14*$M14/10000,O$4*$M14*$M14/703)","v":62.41},{"$f":"IF(Settings!$F$5=\"Metric\",P$4*$M14*$M14/10000,P$4*$M14*$M14/703)","v":74.891999999999996},{"$f":"IF(Settings!$F$5=\"Metric\",Q$4*$M14*$M14/10000,Q$4*$M14*$M14/703)","v":99.855999999999995},186.4,{"$f":"IF(AND(Settings!$C$10>=config!M14,Settings!$C$10<config!M15),Data!$B$1,NA())","v":{"$error":"#N/A"}},{"$f":"IF(ISERROR(S14),NA(),\"My current BMI: \"&TEXT(Summary!$J$4,\"0.0\"))","v":{"$error":"#N/A"}},null,49,90,120,140,160,180,200,{"$f":"IF(AND($AC$3>=config!V14,$AC$3<config!V15),$AB$3,NA())","v":{"$error":"#N/A"}},{"$error":"#N/A"}]
[null,null,null,null,null,null,10,"2016-08-23",{"$f":"Settings!$C$11-((Settings!$C$11-Settings!$E$11)/(Settings!$E$8-Settings!$C$8)*$G15)","v":118.89794520547945},{"$f":"VLOOKUP(H15,data[],2,FALSE)","v":{"$error":"#N/A"}},{"$f":"VLOOKUP(H15,data[],12,FALSE)","v":{"$error":"#N/A"}},null,{"$f":"IF(Settings!$F$5=\"Metric\",M14+2,M14+1)","v":160},{"$f":"IF(Settings!$F$5=\"Metric\",N$4*$M15*$M15/10000,N$4*$M15*$M15/703)","v":47.36},{"$f":"IF(Settings!$F$5=\"Metric\",O$4*$M15*$M15/10000,O$4*$M15*$M15/703)","v":64},{"$f":"IF(Settings!$F$5=\"Metric\",P$4*$M15*$M15/10000,P$4*$M15*$M15/703)","v":76.8},{"$f":"IF(Settings!$F$5=\"Metric\",Q$4*$M15*$M15/10000,Q$4*$M15*$M15/703)","v":102.4},186.4,{"$f":"IF(AND(Settings!$C$10>=config!M15,Settings!$C$10<config!M16),Data!$B$1,NA())","v":{"$error":"#N/A"}},{"$f":"IF(ISERROR(S15),NA(),\"My current BMI: \"&TEXT(Summary!$J$4,\"0.0\"))","v":{"$error":"#N/A"}},null,50,90,120,140,160,180,200,{"$f":"IF(AND($AC$3>=config!V15,$AC$3<config!V16),$AB$3,NA())","v":{"$error":"#N/A"}},{"$error":"#N/A"}]
[null,null,null,null,null,null,11,"2016-08-24",{"$f":"Settings!$C$11-((Settings!$C$11-Settings!$E$11)/(Settings!$E$8-Settings!$C$8)*$G16)","v":118.77773972602739},{"$f":"VLOOKUP(H16,data[],2,FALSE)","v":{"$error":"#N/A"}},{"$f":"VLOOKUP(H16,data[],12,FALSE)","v":{"$error":"#N/A"}},null,{"$f":"IF(Settings!$F$5=\"Metric\",M15+2,M15+1)","v":162},{"$f":"IF(Settings!$F$5=\"Metric\",N$4*$M16*$M16/10000,N$4*$M16*$M16/703)","v":48.551400000000001},{"$f":"IF(Settings!$F$5=\"Metric\",O$4*$M16*$M16/10000,O$4*$M16*$M16/703)","v":65.61},{"$f":"IF(Settings!$F$5=\"Metric\",P$4*$M16*$M16/10000,P$4*$M16*$M16/703)","v":78.731999999999999},{"$f":"IF(Settings!$F$5=\"Metric\",Q$4*$M16*$M16/10000,Q$4*$M16*$M16/703)","v":104.976},186.4,{"$f":"IF(AND(Settings!$C$10>=config!M16,Settings!$C$10<config!M17),Data!$B$1,NA())","v":{"$error":"#N/A"}},{"$f":"IF(ISERROR(S16),NA(),\"My current BMI: \"&TEXT(Summary!$J$4,\"0.0\"))","v":{"$error":"#N/A"}},null,51,90,120,140,160,180,200,{"$f":"IF(AND($AC$3>=config!V16,$AC$3<config!V17),$AB$3,NA())","v":{"$error":"#N/A"}},{"$error":"#N/A"}]
[null,null,null,null,null,null,12,"2016-08-25",{"$f":"Settings!$C$11-((Settings!$C$11-Settings!$E$11)/(Settings!$E$8-Settings!$C$8)*$G17)","v":118.65753424657534},{"$f":"VLOOKUP(H17,data[],2,FALSE)","v":{"$error":"#N/A"}},{"$f":"VLOOKUP(H17,data[],12,FALSE)","v":{"$error":"#N/A"}},null,{"$f":"IF(Settings!$F$5=\"Metric\",M16+2,M16+1)","v":164},{"$f":"IF(Settings!$F$5=\"Metric\",N$4*$M17*$M17/10000,N$4*$M17*$M17/703)","v":49.757599999999996},{"$f":"IF(Settings!$F$5=\"Metric\",O$4*$M17*$M17/10000,O$4*$M17*$M17/703)","v":67.239999999999995},{"$f":"IF(Settings!$F$5=\"Metric\",P$4*$M17*$M17/10000,P$4*$M17*$M17/703)","v":80.688000000000002},{"$f":"IF(Settings!$F$5=\"Metric\",Q$4*$M17*$M17/10000,Q$4*$M17*$M17/703)","v":107.584},186.4,{"$f":"IF(AND(Settings!$C$10>=config!M17,Settings!$C$10<config!M18),Data!$B$1,NA())","v":{"$error":"#N/A"}},{"$f":"IF(ISERROR(S17),NA(),\"My current BMI: \"&TEXT(Summary!$J$4,\"0.0\"))","v":{"$error":"#N/A"}},null,52,90,120,140,160,180,200,{"$f":"IF(AND($AC$3>=config!V17,$AC$3<config!V18),$AB$3,NA())","v":{"$error":"#N/A"}},{"$error":"#N/A"}]
[null,null,null,null,null,null,13,"2016-08-26",{"$f":"Settings!$C$11-((Settings!$C$11-Settings!$E$11)/(Settings!$E$8-Settings!$C$8)*$G18)","v":118.53732876712328},{"$f":"VLOOKUP(H18,data[],2,FALSE)","v":{"$error":"#N/A"}},{"$f":"VLOOKUP(H18,data[],12,FALSE)","v":{"$error":"#N/A"}},null,{"$f":"IF(Settings!$F$5=\"Metric\",M17+2,M17+1)","v":166},{"$f":"IF(Settings!$F$5=\"Metric\",N$4*$M18*$M18/10000,N$4*$M18*$M18/703)","v":50.9786},{"$f":"IF(Settings!$F$5=\"Metric\",O$4*$M18*$M18/10000,O$4*$M18*$M18/703)","v":68.89},{"$f":"IF(Settings!$F$5=\"Metric\",P$4*$M18*$M18/10000,P$4*$M18*$M18/703)","v":82.668000000000006},{"$f":"IF(Settings!$F$5=\"Metric\",Q$4*$M18*$M18/10000,Q$4*$M18*$M18/703)","v":110.224},186.4,{"$f":"IF(AND(Settings!$C$10>=config!M18,Settings!$C$10<config!M19),Data!$B$1,NA())","v":{"$error":"#N/A"}},{"$f":"IF(ISERROR(S18),NA(),\"My current BMI: \"&TEXT(Summary!$J$4,\"0.0\"))","v":{"$error":"#N/A"}},null,53,90,120,140,160,180,200,{"$f":"IF(AND($AC$3>=config!V18,$AC$3<config!V19),$AB$3,NA())","v":{"$error":"#N/A"}},{"$error":"#N/A"}]
[null,null,null,null,null,null,14,"2016-08-27",{"$f":"Settings!$C$11-((Settings!$C$11-Settings!$E$11)/(Settings!$E$8-Settings!$C$8)*$G19)","v":118.41712328767123},{"$f":"VLOOKUP(H19,data[],2,FALSE)","v":{"$error":"#N/A"}},{"$f":"VLOOKUP(H19,data[],12,FALSE)","v":{"$error":"#N/A"}},null,{"$f":"IF(Settings!$F$5=\"Metric\",M18+2,M18+1)","v":168},{"$f":"IF(Settings!$F$5=\"Metric\",N$4*$M19*$M19/10000,N$4*$M19*$M19/703)","v":52.214399999999998},{"$f":"IF(Settings!$F$5=\"Metric\",O$4*$M19*$M19/10000,O$4*$M19*$M19/703)","v":70.56},{"$f":"IF(Settings!$F$5=\"Metric\",P$4*$M19*$M19/10000,P$4*$M19*$M19/703)","v":84.671999999999997},{"$f":"IF(Settings!$F$5=\"Metric\",Q$4*$M19*$M19/10000,Q$4*$M19*$M19/703)","v":112.896},186.4,{"$f":"IF(AND(Settings!$C$10>=config!M19,Settings!$C$10<config!M20),Data!$B$1,NA())","v":{"$error":"#N/A"}},{"$f":"IF(ISERROR(S19),NA(),\"My current BMI: \"&TEXT(Summary!$J$4,\"0.0\"))","v":{"$error":"#N/A"}},null,54,90,120,140,160,180,200,{"$f":"IF(AND($AC$3>=config!V19,$AC$3<config!V20),$AB$3,NA())","v":{"$error":"#N/A"}},{"$error":"#N/A"}]
[null,null,null,null,null,null,15,"2016-08-28",{"$f":"Settings!$C$11-((Settings!$C$11-Settings!$E$11)/(Settings!$E$8-Settings!$C$8)*$G20)","v":118.29691780821918},{"$f":"VLOOKUP(H20,data[],2,FALSE)","v":{"$error":"#N/A"}},{"$f":"VLOOKUP(H20,data[],12,FALSE)","v":{"$error":"#N/A"}},null,{"$f":"IF(Settings!$F$5=\"Metric\",M19+2,M19+1)","v":170},{"$f":"IF(Settings!$F$5=\"Metric\",N$4*$M20*$M20/10000,N$4*$M20*$M20/703)","v":53.465000000000003},{"$f":"IF(Settings!$F$5=\"Metric\",O$4*$M20*$M20/10000,O$4*$M20*$M20/703)","v":72.25},{"$f":"IF(Settings!$F$5=\"Metric\",P$4*$M20*$M20/10000,P$4*$M20*$M20/703)","v":86.7},{"$f":"IF(Settings!$F$5=\"Metric\",Q$4*$M20*$M20/10000,Q$4*$M20*$M20/703)","v":115.6},186.4,{"$f":"IF(AND(Settings!$C$10>=config!M20,Settings!$C$10<config!M21),Data!$B$1,NA())","v":{"$error":"#N/A"}},{"$f":"IF(ISERROR(S20),NA(),\"My current BMI: \"&TEXT(Summary!$J$4,\"0.0\"))","v":{"$error":"#N/A"}},null,55,90,120,140,160,180,200,{"$f":"IF(AND($AC$3>=config!V20,$AC$3<config!V21),$AB$3,NA())","v":{"$error":"#N/A"}},{"$error":"#N/A"}]
[null,null,null,null,null,null,16,"2016-08-29",{"$f":"Settings!$C$11-((Settings!$C$11-Settings!$E$11)/(Settings!$E$8-Settings!$C$8)*$G21)","v":118.17671232876712},{"$f":"VLOOKUP(H21,data[],2,FALSE)","v":{"$error":"#N/A"}},{"$f":"VLOOKUP(H21,data[],12,FALSE)","v":{"$error":"#N/A"}},null,{"$f":"IF(Settings!$F$5=\"Metric\",M20+2,M20+1)","v":172},{"$f":"IF(Settings!$F$5=\"Metric\",N$4*$M21*$M21/10000,N$4*$M21*$M21/703)","v":54.730400000000003},{"$f":"IF(Settings!$F$5=\"Metric\",O$4*$M21*$M21/10000,O$4*$M21*$M21/703)","v":73.959999999999994},{"$f":"IF(Settings!$F$5=\"Metric\",P$4*$M21*$M21/10000,P$4*$M21*$M21/703)","v":88.751999999999995},{"$f":"IF(Settings!$F$5=\"Metric\",Q$4*$M21*$M21/10000,Q$4*$M21*$M21/703)","v":118.336},186.4,{"$f":"IF(AND(Settings!$C$10>=config!M21,Settings!$C$10<config!M22),Data!$B$1,NA())","v":115.7},{"$f":"IF(ISERROR(S21),NA(),\"My current BMI: \"&TEXT(Summary!$J$4,\"0.0\"))","v":"My current BMI: 38.7"},null,56,90,120,140,160,180,200,{"$f":"IF(AND($AC$3>=config!V21,$AC$3<config!V22),$AB$3,NA())","v":{"$error":"#N/A"}},{"$error":"#N/A"}]
[null,null,null,null,null,null,17,"2016-08-30",{"$f":"Settings!$C$11-((Settings!$C$11-Settings!$E$11)/(Settings!$E$8-Settings!$C$8)*$G22)","v":118.05650684931507},{"$f":"VLOOKUP(H22,data[],2,FALSE)","v":{"$error":"#N/A"}},{"$f":"VLOOKUP(H22,data[],12,FALSE)","v":{"$error":"#N/A"}},null,{"$f":"IF(Settings!$F$5=\"Metric\",M21+2,M21+1)","v":174},{"$f":"IF(Settings!$F$5=\"Metric\",N$4*$M22*$M22/10000,N$4*$M22*$M22/703)","v":56.010599999999997},{"$f":"IF(Settings!$F$5=\"Metric\",O$4*$M22*$M22/10000,O$4*$M22*$M22/703)","v":75.69},{"$f":"IF(Settings!$F$5=\"Metric\",P$4*$M22*$M22/10000,P$4*$M22*$M22/703)","v":90.828000000000003},{"$f":"IF(Settings!$F$5=\"Metric\",Q$4*$M22*$M22/10000,Q$4*$M22*$M22/703)","v":121.104},186.4,{"$f":"IF(AND(Settings!$C$10>=config!M22,Settings!$C$10<config!M23),Data!$B$1,NA())","v":{"$error":"#N/A"}},{"$f":"IF(ISERROR(S22),NA(),\"My current BMI: \"&TEXT(Summary!$J$4,\"0.0\"))","v":{"$error":"#N/A"}},null,57,90,120,140,160,180,200,{"$f":"IF(AND($AC$3>=config!V22,$AC$3<config!V23),$AB$3,NA())","v":{"$error":"#N/A"}},{"$error":"#N/A"}]
[null,null,null,null,null,null,18,"2016-08-31",{"$f":"Settings!$C$11-((Settings!$C$11-Settings!$E$11)/(Settings!$E$8-Settings!$C$8)*$G23)","v":117.936301369863},{"$f":"VLOOKUP(H23,data[],2,FALSE)","v":{"$error":"#N/A"}},{"$f":"VLOOKUP(H23,data[],12,FALSE)","v":{"$error":"#N/A"}},null,{"$f":"IF(Settings!$F$5=\"Metric\",M22+2,M22+1)","v":176},{"$f":"IF(Settings!$F$5=\"Metric\",N$4*$M23*$M23/10000,N$4*$M23*$M23/703)","v":57.305599999999998},{"$f":"IF(Settings!$F$5=\"Metric\",O$4*$M23*$M23/10000,O$4*$M23*$M23/703)","v":77.44},{"$f":"IF(Settings!$F$5=\"Metric\",P$4*$M23*$M23/10000,P$4*$M23*$M23/703)","v":92.927999999999997},{"$f":"IF(Settings!$F$5=\"Metric\",Q$4*$M23*$M23/10000,Q$4*$M23*$M23/703)","v":123.904},186.4,{"$f":"IF(AND(Settings!$C$10>=config!M23,Settings!$C$10<config!M24),Data!$B$1,NA())","v":{"$error":"#N/A"}},{"$f":"IF(ISERROR(S23),NA(),\"My current BMI: \"&TEXT(Summary!$J$4,\"0.0\"))","v":{"$error":"#N/A"}},null,58,90,120,140,160,180,200,{"$f":"IF(AND($AC$3>=config!V23,$AC$3<config!V24),$AB$3,NA())","v":{"$error":"#N/A"}},{"$error":"#N/A"}]
[null,null,null,null,null,null,19,"2016-09-01",{"$f":"Settings!$C$11-((Settings!$C$11-Settings!$E$11)/(Settings!$E$8-Settings!$C$8)*$G24)","v":117.81609589041095},{"$f":"VLOOKUP(H24,data[],2,FALSE)","v":{"$error":"#N/A"}},{"$f":"VLOOKUP(H24,data[],12,FALSE)","v":{"$error":"#N/A"}},null,{"$f":"IF(Settings!$F$5=\"Metric\",M23+2,M23+1)","v":178},{"$f":"IF(Settings!$F$5=\"Metric\",N$4*$M24*$M24/10000,N$4*$M24*$M24/703)","v":58.615400000000001},{"$f":"IF(Settings!$F$5=\"Metric\",O$4*$M24*$M24/10000,O$4*$M24*$M24/703)","v":79.209999999999994},{"$f":"IF(Settings!$F$5=\"Metric\",P$4*$M24*$M24/10000,P$4*$M24*$M24/703)","v":95.052000000000007},{"$f":"IF(Settings!$F$5=\"Metric\",Q$4*$M24*$M24/10000,Q$4*$M24*$M24/703)","v":126.736},186.4,{"$f":"IF(AND(Settings!$C$10>=config!M24,Settings!$C$10<config!M25),Data!$B$1,NA())","v":{"$error":"#N/A"}},{"$f":"IF(ISERROR(S24),NA(),\"My current BMI: \"&TEXT(Summary!$J$4,\"0.0\"))","v":{"$error":"#N/A"}},null,59,90,120,140,160,180,200,{"$f":"IF(AND($AC$3>=config!V24,$AC$3<config!V25),$AB$3,NA())","v":{"$error":"#N/A"}},{"$error":"#N/A"}]
[null,null,null,null,null,null,20,"2016-09-02",{"$f":"Settings!$C$11-((Settings!$C$11-Settings!$E$11)/(Settings!$E$8-Settings!$C$8)*$G25)","v":117.6958904109589},{"$f":"VLOOKUP(H25,data[],2,FALSE)","v":118.3},{"$f":"VLOOKUP(H25,data[],12,FALSE)","v":85},null,{"$f":"IF(Settings!$F$5=\"Metric\",M24+2,M24+1)","v":180},{"$f":"IF(Settings!$F$5=\"Metric\",N$4*$M25*$M25/10000,N$4*$M25*$M25/703)","v":59.94},{"$f":"IF(Settings!$F$5=\"Metric\",O$4*$M25*$M25/10000,O$4*$M25*$M25/703)","v":81},{"$f":"IF(Settings!$F$5=\"Metric\",P$4*$M25*$M25/10000,P$4*$M25*$M25/703)","v":97.2},{"$f":"IF(Settings!$F$5=\"Metric\",Q$4*$M25*$M25/10000,Q$4*$M25*$M25/703)","v":129.6},186.4,{"$f":"IF(AND(Settings!$C$10>=config!M25,Settings!$C$10<config!M26),Data!$B$1,NA())","v":{"$error":"#N/A"}},{"$f":"IF(ISERROR(S25),NA(),\"My current BMI: \"&TEXT(Summary!$J$4,\"0.0\"))","v":{"$error":"#N/A"}},null,60,{"$f":"NA()","v":{"$error":"#N/A"}},120,140,160,180,200,{"$f":"IF(AND($AC$3>=config!V25,$AC$3<config!V26),$AB$3,NA())","v":{"$error":"#N/A"}},{"$error":"#N/A"}]
[null,null,null,null,null,null,21,"2016-09-03",{"$f":"Settings!$C$11-((Settings!$C$11-Settings!$E$11)/(Settings!$E$8-Settings!$C$8)*$G26)","v":117.57568493150684},{"$f":"VLOOKUP(H26,data[],2,FALSE)","v":{"$error":"#N/A"}},{"$f":"VLOOKUP(H26,data[],12,FALSE)","v":{"$error":"#N/A"}},null,{"$f":"IF(Settings!$F$5=\"Metric\",M25+2,M25+1)","v":182},{"$f":"IF(Settings!$F$5=\"Metric\",N$4*$M26*$M26/10000,N$4*$M26*$M26/703)","v":61.279400000000003},{"$f":"IF(Settings!$F$5=\"Metric\",O$4*$M26*$M26/10000,O$4*$M26*$M26/703)","v":82.81},{"$f":"IF(Settings!$F$5=\"Metric\",P$4*$M26*$M26/10000,P$4*$M26*$M26/703)","v":99.372},{"$f":"IF(Settings!$F$5=\"Metric\",Q$4*$M26*$M26/10000,Q$4*$M26*$M26/703)","v":132.49600000000001},186.4,{"$f":"IF(AND(Settings!$C$10>=config!M26,Settings!$C$10<config!M27),Data!$B$1,NA())","v":{"$error":"#N/A"}},{"$f":"IF(ISERROR(S26),NA(),\"My current BMI: \"&TEXT(Summary!$J$4,\"0.0\"))","v":{"$error":"#N/A"}},null,61,{"$f":"NA()","v":{"$error":"#N/A"}},120,140,160,180,200,{"$f":"IF(AND($AC$3>=config!V26,$AC$3<config!V27),$AB$3,NA())","v":{"$error":"#N/A"}},{"$error":"#N/A"}]
[null,null,null,null,null,null,22,"2016-09-04",{"$f":"Settings!$C$11-((Settings!$C$11-Settings!$E$11)/(Settings!$E$8-Settings!$C$8)*$G27)","v":117.45547945205479},{"$f":"VLOOKUP(H27,data[],2,FALSE)","v":{"$error":"#N/A"}},{"$f":"VLOOKUP(H27,data[],12,FALSE)","v":{"$error":"#N/A"}},null,{"$f":"IF(Settings!$F$5=\"Metric\",M26+2,M26+1)","v":184},{"$f":"IF(Settings!$F$5=\"Metric\",N$4*$M27*$M27/10000,N$4*$M27*$M27/703)","v":62.633600000000001},{"$f":"IF(Settings!$F$5=\"Metric\",O$4*$M27*$M27/10000,O$4*$M27*$M27/703)","v":84.64},{"$f":"IF(Settings!$F$5=\"Metric\",P$4*$M27*$M27/10000,P$4*$M27*$M27/703)","v":101.568},{"$f":"IF(Settings!$F$5=\"Metric\",Q$4*$M27*$M27/10000,Q$4*$M27*$M27/703)","v":135.42400000000001},186.4,{"$f":"IF(AND(Settings!$C$10>=config!M27,Settings!$C$10<config!M28),Data!$B$1,NA())","v":{"$error":"#N/A"}},{"$f":"IF(ISERROR(S27),NA(),\"My current BMI: \"&TEXT(Summary!$J$4,\"0.0\"))","v":{"$error":"#N/A"}},null,62,{"$f":"NA()","v":{"$error":"#N/A"}},120,140,160,180,200,{"$f":"IF(AND($AC$3>=config!V27,$AC$3<config!V28),$AB$3,NA())","v":{"$error":"#N/A"}},{"$error":"#N/A"}]
[null,null,null,null,null,null,23,"2016-09-05",{"$f":"Settings!$C$11-((Settings!$C$11-Settings!$E$11)/(Settings!$E$8-Settings!$C$8)*$G28)","v":117.33527397260274},{"$f":"VLOOKUP(H28,data[],2,FALSE)","v":{"$error":"#N/A"}},{"$f":"VLOOKUP(H28,data[],12,FALSE)","v":{"$error":"#N/A"}},null,{"$f":"IF(Settings!$F$5=\"Metric\",M27+2,M27+1)","v":186},{"$f":"IF(Settings!$F$5=\"Metric\",N$4*$M28*$M28/10000,N$4*$M28*$M28/703)","v":64.002600000000001},{"$f":"IF(Settings!$F$5=\"Metric\",O$4*$M28*$M28/10000,O$4*$M28*$M28/703)","v":86.49},{"$f":"IF(Settings!$F$5=\"Metric\",P$4*$M28*$M28/10000,P$4*$M28*$M28/703)","v":103.788},{"$f":"IF(Settings!$F$5=\"Metric\",Q$4*$M28*$M28/10000,Q$4*$M28*$M28/703)","v":138.38399999999999},186.4,{"$f":"IF(AND(Settings!$C$10>=config!M28,Settings!$C$10<config!M29),Data!$B$1,NA())","v":{"$error":"#N/A"}},{"$f":"IF(ISERROR(S28),NA(),\"My current BMI: \"&TEXT(Summary!$J$4,\"0.0\"))","v":{"$error":"#N/A"}},null,63,{"$f":"NA()","v":{"$error":"#N/A"}},120,140,160,180,200,{"$f":"IF(AND($AC$3>=config!V28,$AC$3<config!V29),$AB$3,NA())","v":{"$error":"#N/A"}},{"$error":"#N/A"}]
[null,null,null,null,null,null,24,"2016-09-06",{"$f":"Settings!$C$11-((Settings!$C$11-Settings!$E$11)/(Settings!$E$8-Settings!$C$8)*$G29)","v":117.21506849315068},{"$f":"VLOOKUP(H29,data[],2,FALSE)","v":{"$error":"#N/A"}},{"$f":"VLOOKUP(H29,data[],12,FALSE)","v":{"$error":"#N/A"}},null,{"$f":"IF(Settings!$F$5=\"Metric\",M28+2,M28+1)","v":188},{"$f":"IF(Settings!$F$5=\"Metric\",N$4*$M29*$M29/10000,N$4*$M29*$M29/703)","v":65.386399999999995},{"$f":"IF(Settings!$F$5=\"Metric\",O$4*$M29*$M29/10000,O$4*$M29*$M29/703)","v":88.36},{"$f":"IF(Settings!$F$5=\"Metric\",P$4*$M29*$M29/10000,P$4*$M29*$M29/703)","v":106.032},{"$f":"IF(Settings!$F$5=\"Metric\",Q$4*$M29*$M29/10000,Q$4*$M29*$M29/703)","v":141.376},186.4,{"$f":"IF(AND(Settings!$C$10>=config!M29,Settings!$C$10<config!M30),Data!$B$1,NA())","v":{"$error":"#N/A"}},{"$f":"IF(ISERROR(S29),NA(),\"My current BMI: \"&TEXT(Summary!$J$4,\"0.0\"))","v":{"$error":"#N/A"}},null,64,{"$f":"NA()","v":{"$error":"#N/A"}},120,140,160,180,200,{"$f":"IF(AND($AC$3>=config!V29,$AC$3<config!V30),$AB$3,NA())","v":{"$error":"#N/A"}},{"$error":"#N/A"}]
[null,null,null,null,null,null,25,"2016-09-07",{"$f":"Settings!$C$11-((Settings!$C$11-Settings!$E$11)/(Settings!$E$8-Settings!$C$8)*$G30)","v":117.09486301369863},{"$f":"VLOOKUP(H30,data[],2,FALSE)","v":{"$error":"#N/A"}},{"$f":"VLOOKUP(H30,data[],12,FALSE)","v":{"$error":"#N/A"}},null,{"$f":"IF(Settings!$F$5=\"Metric\",M29+2,M29+1)","v":190},{"$f":"IF(Settings!$F$5=\"Metric\",N$4*$M30*$M30/10000,N$4*$M30*$M30/703)","v":66.784999999999997},{"$f":"IF(Settings!$F$5=\"Metric\",O$4*$M30*$M30/10000,O$4*$M30*$M30/703)","v":90.25},{"$f":"IF(Settings!$F$5=\"Metric\",P$4*$M30*$M30/10000,P$4*$M30*$M30/703)","v":108.3},{"$f":"IF(Settings!$F$5=\"Metric\",Q$4*$M30*$M30/10000,Q$4*$M30*$M30/703)","v":144.4},186.4,{"$f":"IF(AND(Settings!$C$10>=config!M30,Settings!$C$10<config!M31),Data!$B$1,NA())","v":{"$error":"#N/A"}},{"$f":"IF(ISERROR(S30),NA(),\"My current BMI: \"&TEXT(Summary!$J$4,\"0.0\"))","v":{"$error":"#N/A"}},null,65,{"$f":"NA()","v":{"$error":"#N/A"}},120,140,160,180,200,{"$f":"IF(AND($AC$3>=config!V30,$AC$3<config!V31),$AB$3,NA())","v":{"$error":"#N/A"}},{"$error":"#N/A"}]
[null,null,null,null,null,null,26,"2016-09-08",{"$f":"Settings!$C$11-((Settings!$C$11-Settings!$E$11)/(Settings!$E$8-Settings!$C$8)*$G31)","v":116.97465753424657},{"$f":"VLOOKUP(H31,data[],2,FALSE)","v":{"$error":"#N/A"}},{"$f":"VLOOKUP(H31,data[],12,FALSE)","v":{"$error":"#N/A"}},null,{"$f":"IF(Settings!$F$5=\"Metric\",M30+2,M30+1)","v":192},{"$f":"IF(Settings!$F$5=\"Metric\",N$4*$M31*$M31/10000,N$4*$M31*$M31/703)","v":68.198400000000007},{"$f":"IF(Settings!$F$5=\"Metric\",O$4*$M31*$M31/10000,O$4*$M31*$M31/703)","v":92.16},{"$f":"IF(Settings!$F$5=\"Metric\",P$4*$M31*$M31/10000,P$4*$M31*$M31/703)","v":110.592},{"$f":"IF(Settings!$F$5=\"Metric\",Q$4*$M31*$M31/10000,Q$4*$M31*$M31/703)","v":147.45599999999999},186.4,{"$f":"IF(AND(Settings!$C$10>=config!M31,Settings!$C$10<config!M32),Data!$B$1,NA())","v":{"$error":"#N/A"}},{"$f":"IF(ISERROR(S31),NA(),\"My current BMI: \"&TEXT(Summary!$J$4,\"0.0\"))","v":{"$error":"#N/A"}},null,66,{"$f":"NA()","v":{"$error":"#N/A"}},120,140,160,180,200,{"$f":"IF(AND($AC$3>=config!V31,$AC$3<config!V32),$AB$3,NA())","v":{"$error":"#N/A"}},{"$error":"#N/A"}]
[null,null,null,null,null,null,27,"2016-09-09",{"$f":"Settings!$C$11-((Settings!$C$11-Settings!$E$11)/(Settings!$E$8-Settings!$C$8)*$G32)","v":116.85445205479452},{"$f":"VLOOKUP(H32,data[],2,FALSE)","v":{"$error":"#N/A"}},{"$f":"VLOOKUP(H32,data[],12,FALSE)","v":{"$error":"#N/A"}},null,{"$f":"IF(Settings!$F$5=\"Metric\",M31+2,M31+1)","v":194},{"$f":"IF(Settings!$F$5=\"Metric\",N$4*$M32*$M32/10000,N$4*$M32*$M32/703)","v":69.626599999999996},{"$f":"IF(Settings!$F$5=\"Metric\",O$4*$M32*$M32/10000,O$4*$M32*$M32/703)","v":94.09},{"$f":"IF(Settings!$F$5=\"Metric\",P$4*$M32*$M32/10000,P$4*$M32*$M32/703)","v":112.908},{"$f":"IF(Settings!$F$5=\"Metric\",Q$4*$M32*$M32/10000,Q$4*$M32*$M32/703)","v":150.54400000000001},186.4,{"$f":"IF(AND(Settings!$C$10>=config!M32,Settings!$C$10<config!M33),Data!$B$1,NA())","v":{"$error":"#N/A"}},{"$f":"IF(ISERROR(S32),NA(),\"My current BMI: \"&TEXT(Summary!$J$4,\"0.0\"))","v":{"$error":"#N/A"}},null,67,{"$f":"NA()","v":{"$error":"#N/A"}},120,140,160,180,200,{"$f":"IF(AND($AC$3>=config!V32,$AC$3<config!V33),$AB$3,NA())","v":{"$error":"#N/A"}},{"$error":"#N/A"}]
[null,null,null,null,null,null,28,"2016-09-10",{"$f":"Settings!$C$11-((Settings!$C$11-Settings!$E$11)/(Settings!$E$8-Settings!$C$8)*$G33)","v":116.73424657534247},{"$f":"VLOOKUP(H33,data[],2,FALSE)","v":{"$error":"#N/A"}},{"$f":"VLOOKUP(H33,data[],12,FALSE)","v":{"$error":"#N/A"}},null,{"$f":"IF(Settings!$F$5=\"Metric\",M32+2,M32+1)","v":196},{"$f":"IF(Settings!$F$5=\"Metric\",N$4*$M33*$M33/10000,N$4*$M33*$M33/703)","v":71.069599999999994},{"$f":"IF(Settings!$F$5=\"Metric\",O$4*$M33*$M33/10000,O$4*$M33*$M33/703)","v":96.04},{"$f":"IF(Settings!$F$5=\"Metric\",P$4*$M33*$M33/10000,P$4*$M33*$M33/703)","v":115.248},{"$f":"IF(Settings!$F$5=\"Metric\",Q$4*$M33*$M33/10000,Q$4*$M33*$M33/703)","v":153.66399999999999},186.4,{"$f":"IF(AND(Settings!$C$10>=config!M33,Settings!$C$10<config!M34),Data!$B$1,NA())","v":{"$error":"#N/A"}},{"$f":"IF(ISERROR(S33),NA(),\"My current BMI: \"&TEXT(Summary!$J$4,\"0.0\"))","v":{"$error":"#N/A"}},null,68,{"$f":"NA()","v":{"$error":"#N/A"}},120,140,160,180,200,{"$f":"IF(AND($AC$3>=config!V33,$AC$3<config!V34),$AB$3,NA())","v":{"$error":"#N/A"}},{"$error":"#N/A"}]
[null,null,null,null,null,null,29,"2016-09-11",{"$f":"Settings!$C$11-((Settings!$C$11-Settings!$E$11)/(Settings!$E$8-Settings!$C$8)*$G34)","v":116.6140410958904},{"$f":"VLOOKUP(H34,data[],2,FALSE)","v":{"$error":"#N/A"}},{"$f":"VLOOKUP(H34,data[],12,FALSE)","v":{"$error":"#N/A"}},null,{"$f":"IF(Settings!$F$5=\"Metric\",M33+2,M33+1)","v":198},{"$f":"IF(Settings!$F$5=\"Metric\",N$4*$M34*$M34/10000,N$4*$M34*$M34/703)","v":72.5274},{"$f":"IF(Settings!$F$5=\"Metric\",O$4*$M34*$M34/10000,O$4*$M34*$M34/703)","v":98.01},{"$f":"IF(Settings!$F$5=\"Metric\",P$4*$M34*$M34/10000,P$4*$M34*$M34/703)","v":117.61199999999999},{"$f":"IF(Settings!$F$5=\"Metric\",Q$4*$M34*$M34/10000,Q$4*$M34*$M34/703)","v":156.816},186.4,{"$f":"IF(AND(Settings!$C$10>=config!M34,Settings!$C$10<config!M35),Data!$B$1,NA())","v":{"$error":"#N/A"}},{"$f":"IF(ISERROR(S34),NA(),\"My current BMI: \"&TEXT(Summary!$J$4,\"0.0\"))","v":{"$error":"#N/A"}},null,69,{"$f":"NA()","v":{"$error":"#N/A"}},120,140,160,180,200,{"$f":"IF(AND($AC$3>=config!V34,$AC$3<config!V35),$AB$3,NA())","v":{"$error":"#N/A"}},{"$error":"#N/A"}]
[null,null,null,null,null,null,30,"2016-09-12",{"$f":"Settings!$C$11-((Settings!$C$11-Settings!$E$11)/(Settings!$E$8-Settings!$C$8)*$G35)","v":116.49383561643835},{"$f":"VLOOKUP(H35,data[],2,FALSE)","v":{"$error":"#N/A"}},{"$f":"VLOOKUP(H35,data[],12,FALSE)","v":{"$error":"#N/A"}},null,{"$f":"IF(Settings!$F$5=\"Metric\",M34+2,M34+1)","v":200},{"$f":"IF(Settings!$F$5=\"Metric\",N$4*$M35*$M35/10000,N$4*$M35*$M35/703)","v":74},{"$f":"IF(Settings!$F$5=\"Metric\",O$4*$M35*$M35/10000,O$4*$M35*$M35/703)","v":100},{"$f":"IF(Settings!$F$5=\"Metric\",P$4*$M35*$M35/10000,P$4*$M35*$M35/703)","v":120},{"$f":"IF(Settings!$F$5=\"Metric\",Q$4*$M35*$M35/10000,Q$4*$M35*$M35/703)","v":160},186.4,{"$f":"IF(AND(Settings!$C$10>=config!M35,Settings!$C$10<config!M36),Data!$B$1,NA())","v":{"$error":"#N/A"}},{"$f":"IF(ISERROR(S35),NA(),\"My current BMI: \"&TEXT(Summary!$J$4,\"0.0\"))","v":{"$error":"#N/A"}},null,70,{"$f":"NA()","v":{"$error":"#N/A"}},120,140,160,180,200,{"$f":"IF(AND($AC$3>=config!V35,$AC$3<config!V36),$AB$3,NA())","v":{"$error":"#N/A"}},{"$error":"#N/A"}]
[null,null,null,null,null,null,31,"2016-09-13",{"$f":"Settings!$C$11-((Settings!$C$11-Settings!$E$11)/(Settings!$E$8-Settings!$C$8)*$G36)","v":116.37363013698629},{"$f":"VLOOKUP(H36,data[],2,FALSE)","v":{"$error":"#N/A"}},{"$f":"VLOOKUP(H36,data[],12,FALSE)","v":{"$error":"#N/A"}},null,{"$f":"IF(Settings!$F$5=\"Metric\",M35+2,M35+1)","v":202},{"$f":"IF(Settings!$F$5=\"Metric\",N$4*$M36*$M36/10000,N$4*$M36*$M36/703)","v":75.487399999999994},{"$f":"IF(Settings!$F$5=\"Metric\",O$4*$M36*$M36/10000,O$4*$M36*$M36/703)","v":102.01},{"$f":"IF(Settings!$F$5=\"Metric\",P$4*$M36*$M36/10000,P$4*$M36*$M36/703)","v":122.41200000000001},{"$f":"IF(Settings!$F$5=\"Metric\",Q$4*$M36*$M36/10000,Q$4*$M36*$M36/703)","v":163.21600000000001},186.4,{"$f":"IF(AND(Settings!$C$10>=config!M36,Settings!$C$10<config!M37),Data!$B$1,NA())","v":{"$error":"#N/A"}},{"$f":"IF(ISERROR(S36),NA(),\"My current BMI: \"&TEXT(Summary!$J$4,\"0.0\"))","v":{"$error":"#N/A"}},null,{"$f":"V35+1","v":71},{"$f":"NA()","v":{"$error":"#N/A"}},120,140,160,180,200,{"$f":"IF(AND($AC$3>=config!V36,$AC$3<config!V37),$AB$3,NA())","v":{"$error":"#N/A"}},{"$error":"#N/A"}]
[null,null,null,null,null,null,32,"2016-09-14",{"$f":"Settings!$C$11-((Settings!$C$11-Settings!$E$11)/(Settings!$E$8-Settings!$C$8)*$G37)","v":116.25342465753424},{"$f":"VLOOKUP(H37,data[],2,FALSE)","v":{"$error":"#N/A"}},{"$f":"VLOOKUP(H37,data[],12,FALSE)","v":{"$error":"#N/A"}},null,{"$f":"IF(Settings!$F$5=\"Metric\",M36+2,M36+1)","v":204},{"$f":"IF(Settings!$F$5=\"Metric\",N$4*$M37*$M37/10000,N$4*$M37*$M37/703)","v":76.989599999999996},{"$f":"IF(Settings!$F$5=\"Metric\",O$4*$M37*$M37/10000,O$4*$M37*$M37/703)","v":104.04},{"$f":"IF(Settings!$F$5=\"Metric\",P$4*$M37*$M37/10000,P$4*$M37*$M37/703)","v":124.848},{"$f":"IF(Settings!$F$5=\"Metric\",Q$4*$M37*$M37/10000,Q$4*$M37*$M37/703)","v":166.464},186.4,{"$f":"IF(AND(Settings!$C$10>=config!M37,Settings!$C$10<config!M38),Data!$B$1,NA())","v":{"$error":"#N/A"}},{"$f":"IF(ISERROR(S37),NA(),\"My current BMI: \"&TEXT(Summary!$J$4,\"0.0\"))","v":{"$error":"#N/A"}},null,72,{"$f":"NA()","v":{"$error":"#N/A"}},120,140,160,180,200,{"$f":"IF(AND($AC$3>=config!V37,$AC$3<config!V38),$AB$3,NA())","v":{"$error":"#N/A"}},{"$error":"#N/A"}]
[null,null,null,null,null,null,33,"2016-09-15",{"$f":"Settings!$C$11-((Settings!$C$11-Settings!$E$11)/(Settings!$E$8-Settings!$C$8)*$G38)","v":116.13321917808219},{"$f":"VLOOKUP(H38,data[],2,FALSE)","v":{"$error":"#N/A"}},{"$f":"VLOOKUP(H38,data[],12,FALSE)","v":{"$error":"#N/A"}},null,{"$f":"IF(Settings!$F$5=\"Metric\",M37+2,M37+1)","v":206},{"$f":"IF(Settings!$F$5=\"Metric\",N$4*$M38*$M38/10000,N$4*$M38*$M38/703)","v":78.506600000000006},{"$f":"IF(Settings!$F$5=\"Metric\",O$4*$M38*$M38/10000,O$4*$M38*$M38/703)","v":106.09},{"$f":"IF(Settings!$F$5=\"Metric\",P$4*$M38*$M38/10000,P$4*$M38*$M38/703)","v":127.30800000000001},{"$f":"IF(Settings!$F$5=\"Metric\",Q$4*$M38*$M38/10000,Q$4*$M38*$M38/703)","v":169.744},186.4,{"$f":"IF(AND(Settings!$C$10>=config!M38,Settings!$C$10<config!M39),Data!$B$1,NA())","v":{"$error":"#N/A"}},{"$f":"IF(ISERROR(S38),NA(),\"My current BMI: \"&TEXT(Summary!$J$4,\"0.0\"))","v":{"$error":"#N/A"}},null,73,{"$f":"NA()","v":{"$error":"#N/A"}},120,140,160,180,200,{"$f":"IF(AND($AC$3>=config!V38,$AC$3<config!V39),$AB$3,NA())","v":{"$error":"#N/A"}},{"$error":"#N/A"}]
[null,null,null,null,null,null,34,"2016-09-16",{"$f":"Settings!$C$11-((Settings!$C$11-Settings!$E$11)/(Settings!$E$8-Settings!$C$8)*$G39)","v":116.01301369863013},{"$f":"VLOOKUP(H39,data[],2,FALSE)","v":{"$error":"#N/A"}},{"$f":"VLOOKUP(H39,data[],12,FALSE)","v":{"$error":"#N/A"}},null,{"$f":"IF(Settings!$F$5=\"Metric\",M38+2,M38+1)","v":208},{"$f":"IF(Settings!$F$5=\"Metric\",N$4*$M39*$M39/10000,N$4*$M39*$M39/703)","v":80.038399999999996},{"$f":"IF(Settings!$F$5=\"Metric\",O$4*$M39*$M39/10000,O$4*$M39*$M39/703)","v":108.16},{"$f":"IF(Settings!$F$5=\"Metric\",P$4*$M39*$M39/10000,P$4*$M39*$M39/703)","v":129.792},{"$f":"IF(Settings!$F$5=\"Metric\",Q$4*$M39*$M39/10000,Q$4*$M39*$M39/703)","v":173.05600000000001},186.4,{"$f":"IF(AND(Settings!$C$10>=config!M39,Settings!$C$10<config!M40),Data!$B$1,NA())","v":{"$error":"#N/A"}},{"$f":"IF(ISERROR(S39),NA(),\"My current BMI: \"&TEXT(Summary!$J$4,\"0.0\"))","v":{"$error":"#N/A"}},null,74,{"$f":"NA()","v":{"$error":"#N/A"}},120,140,160,180,200,{"$f":"IF(AND($AC$3>=config!V39,$AC$3<config!V40),$AB$3,NA())","v":{"$error":"#N/A"}},{"$error":"#N/A"}]
[null,null,null,null,null,null,35,"2016-09-17",{"$f":"Settings!$C$11-((Settings!$C$11-Settings!$E$11)/(Settings!$E$8-Settings!$C$8)*$G40)","v":115.89280821917808},{"$f":"VLOOKUP(H40,data[],2,FALSE)","v":{"$error":"#N/A"}},{"$f":"VLOOKUP(H40,data[],12,FALSE)","v":{"$error":"#N/A"}},null,{"$f":"IF(Settings!$F$5=\"Metric\",M39+2,M39+1)","v":210},{"$f":"IF(Settings!$F$5=\"Metric\",N$4*$M40*$M40/10000,N$4*$M40*$M40/703)","v":81.584999999999994},{"$f":"IF(Settings!$F$5=\"Metric\",O$4*$M40*$M40/10000,O$4*$M40*$M40/703)","v":110.25},{"$f":"IF(Settings!$F$5=\"Metric\",P$4*$M40*$M40/10000,P$4*$M40*$M40/703)","v":132.30000000000001},{"$f":"IF(Settings!$F$5=\"Metric\",Q$4*$M40*$M40/10000,Q$4*$M40*$M40/703)","v":176.4},186.4,{"$f":"IF(AND(Settings!$C$10>=config!M40,Settings!$C$10<config!M41),Data!$B$1,NA())","v":{"$error":"#N/A"}},{"$f":"IF(ISERROR(S40),NA(),\"My current BMI: \"&TEXT(Summary!$J$4,\"0.0\"))","v":{"$error":"#N/A"}},null,75,{"$f":"NA()","v":{"$error":"#N/A"}},120,140,160,180,200,{"$f":"IF(AND($AC$3>=config!V40,$AC$3<config!V41),$AB$3,NA())","v":{"$error":"#N/A"}},{"$error":"#N/A"}]
[null,null,null,null,null,null,36,"2016-09-18",{"$f":"Settings!$C$11-((Settings!$C$11-Settings!$E$11)/(Settings!$E$8-Settings!$C$8)*$G41)","v":115.77260273972603},{"$f":"VLOOKUP(H41,data[],2,FALSE)","v":{"$error":"#N/A"}},{"$f":"VLOOKUP(H41,data[],12,FALSE)","v":{"$error":"#N/A"}},null,null,null,null,null,null,null,null,null,null,76,{"$f":"NA()","v":{"$error":"#N/A"}},120,140,160,180,200,{"$f":"IF(AND($AC$3>=config!V41,$AC$3<config!V42),$AB$3,NA())","v":{"$error":"#N/A"}},{"$error":"#N/A"}]
[null,null,null,null,null,null,37,"2016-09-19",{"$f":"Settings!$C$11-((Settings!$C$11-Settings!$E$11)/(Settings!$E$8-Settings!$C$8)*$G42)","v":115.65239726027397},{"$f":"VLOOKUP(H42,data[],2,FALSE)","v":{"$error":"#N/A"}},{"$f":"VLOOKUP(H42,data[],12,FALSE)","v":{"$error":"#N/A"}},null,null,null,null,null,null,null,null,null,null,77,{"$f":"NA()","v":{"$error":"#N/A"}},120,140,160,180,200,{"$f":"IF(AND($AC$3>=config!V42,$AC$3<config!V43),$AB$3,NA())","v":{"$error":"#N/A"}},{"$error":"#N/A"}]
[null,null,null,null,null,null,38,"2016-09-20",{"$f":"Settings!$C$11-((Settings!$C$11-Settings!$E$11)/(Settings!$E$8-Settings!$C$8)*$G43)","v":115.53219178082192},{"$f":"VLOOKUP(H43,data[],2,FALSE)","v":{"$error":"#N/A"}},{"$f":"VLOOKUP(H43,data[],12,FALSE)","v":{"$error":"#N/A"}},null,null,null,null,null,null,null,null,null,null,78,{"$f":"NA()","v":{"$error":"#N/A"}},120,140,160,180,200,{"$f":"IF(AND($AC$3>=config!V43,$AC$3<config!V44),$AB$3,NA())","v":{"$error":"#N/A"}},{"$error":"#N/A"}]
[null,null,null,null,null,null,39,"2016-09-21",{"$f":"Settings!$C$11-((Settings!$C$11-Settings!$E$11)/(Settings!$E$8-Settings!$C$8)*$G44)","v":115.41198630136986},{"$f":"VLOOKUP(H44,data[],2,FALSE)","v":{"$error":"#N/A"}},{"$f":"VLOOKUP(H44,data[],12,FALSE)","v":{"$error":"#N/A"}},null,null,null,null,null,null,null,null,null,null,79,{"$f":"NA()","v":{"$error":"#N/A"}},120,140,160,180,200,{"$f":"IF(AND($AC$3>=config!V44,$AC$3<config!V45),$AB$3,NA())","v":{"$error":"#N/A"}},{"$error":"#N/A"}]
[null,null,null,null,null,null,40,"2016-09-22",{"$f":"Settings!$C$11-((Settings!$C$11-Settings!$E$11)/(Settings!$E$8-Settings!$C$8)*$G45)","v":115.2917808219178},{"$f":"VLOOKUP(H45,data[],2,FALSE)","v":{"$error":"#N/A"}},{"$f":"VLOOKUP(H45,data[],12,FALSE)","v":{"$error":"#N/A"}},null,null,null,null,null,null,null,null,null,null,80,{"$f":"NA()","v":{"$error":"#N/A"}},120,140,160,180,200,{"$f":"IF(AND($AC$3>=config!V45,$AC$3<config!V46),$AB$3,NA())","v":{"$error":"#N/A"}},{"$error":"#N/A"}]
[null,null,null,null,null,null,41,"2016-09-23",{"$f":"Settings!$C$11-((Settings!$C$11-Settings!$E$11)/(Settings!$E$8-Settings!$C$8)*$G46)","v":115.17157534246574},{"$f":"VLOOKUP(H46,data[],2,FALSE)","v":{"$error":"#N/A"}},{"$f":"VLOOKUP(H46,data[],12,FALSE)","v":{"$error":"#N/A"}},null,null,null,null,null,null,null,null,null,null,81,{"$f":"NA()","v":{"$error":"#N/A"}},{"$f":"NA()","v":{"$error":"#N/A"}},140,160,180,200,{"$f":"IF(AND($AC$3>=config!V46,$AC$3<config!V47),$AB$3,NA())","v":{"$error":"#N/A"}},{"$error":"#N/A"}]
[null,null,null,null,null,null,42,"2016-09-24",{"$f":"Settings!$C$11-((Settings!$C$11-Settings!$E$11)/(Settings!$E$8-Settings!$C$8)*$G47)","v":115.05136986301369},{"$f":"VLOOKUP(H47,data[],2,FALSE)","v":{"$error":"#N/A"}},{"$f":"VLOOKUP(H47,data[],12,FALSE)","v":{"$error":"#N/A"}},null,null,null,null,null,null,null,null,null,null,82,{"$f":"NA()","v":{"$error":"#N/A"}},{"$f":"NA()","v":{"$error":"#N/A"}},140,160,180,200,{"$f":"IF(AND($AC$3>=config!V47,$AC$3<config!V48),$AB$3,NA())","v":{"$error":"#N/A"}},{"$error":"#N/A"}]
[null,null,null,null,null,null,43,"2016-09-25",{"$f":"Settings!$C$11-((Settings!$C$11-Settings!$E$11)/(Settings!$E$8-Settings!$C$8)*$G48)","v":114.93116438356164},{"$f":"VLOOKUP(H48,data[],2,FALSE)","v":{"$error":"#N/A"}},{"$f":"VLOOKUP(H48,data[],12,FALSE)","v":{"$error":"#N/A"}},null,null,null,null,null,null,null,null,null,null,83,{"$f":"NA()","v":{"$error":"#N/A"}},{"$f":"NA()","v":{"$error":"#N/A"}},140,160,180,200,{"$f":"IF(AND($AC$3>=config!V48,$AC$3<config!V49),$AB$3,NA())","v":{"$error":"#N/A"}},{"$error":"#N/A"}]
[null,null,null,null,null,null,44,"2016-09-26",{"$f":"Settings!$C$11-((Settings!$C$11-Settings!$E$11)/(Settings!$E$8-Settings!$C$8)*$G49)","v":114.81095890410958},{"$f":"VLOOKUP(H49,data[],2,FALSE)","v":{"$error":"#N/A"}},{"$f":"VLOOKUP(H49,data[],12,FALSE)","v":{"$error":"#N/A"}},null,null,null,null,null,null,null,null,null,null,84,{"$f":"NA()","v":{"$error":"#N/A"}},{"$f":"NA()","v":{"$error":"#N/A"}},140,160,180,200,{"$f":"IF(AND($AC$3>=config!V49,$AC$3<config!V50),$AB$3,NA())","v":{"$error":"#N/A"}},{"$error":"#N/A"}]
[null,null,null,null,null,null,45,"2016-09-27",{"$f":"Settings!$C$11-((Settings!$C$11-Settings!$E$11)/(Settings!$E$8-Settings!$C$8)*$G50)","v":114.69075342465753},{"$f":"VLOOKUP(H50,data[],2,FALSE)","v":{"$error":"#N/A"}},{"$f":"VLOOKUP(H50,data[],12,FALSE)","v":{"$error":"#N/A"}},null,null,null,null,null,null,null,null,null,null,85,{"$f":"NA()","v":{"$error":"#N/A"}},{"$f":"NA()","v":{"$error":"#N/A"}},140,160,180,200,{"$f":"IF(AND($AC$3>=config!V50,$AC$3<config!V51),$AB$3,NA())","v":{"$error":"#N/A"}},{"$error":"#N/A"}]
[null,null,null,null,null,null,46,"2016-09-28",{"$f":"Settings!$C$11-((Settings!$C$11-Settings!$E$11)/(Settings!$E$8-Settings!$C$8)*$G51)","v":114.57054794520548},{"$f":"VLOOKUP(H51,data[],2,FALSE)","v":{"$error":"#N/A"}},{"$f":"VLOOKUP(H51,data[],12,FALSE)","v":{"$error":"#N/A"}},null,null,null,null,null,null,null,null,null,null,86,{"$f":"NA()","v":{"$error":"#N/A"}},{"$f":"NA()","v":{"$error":"#N/A"}},140,160,180,200,{"$f":"IF(AND($AC$3>=config!V51,$AC$3<config!V52),$AB$3,NA())","v":{"$error":"#N/A"}},{"$error":"#N/A"}]
[null,null,null,null,null,null,47,"2016-09-29",{"$f":"Settings!$C$11-((Settings!$C$11-Settings!$E$11)/(Settings!$E$8-Settings!$C$8)*$G52)","v":114.45034246575342},{"$f":"VLOOKUP(H52,data[],2,FALSE)","v":{"$error":"#N/A"}},{"$f":"VLOOKUP(H52,data[],12,FALSE)","v":{"$error":"#N/A"}},null,null,null,null,null,null,null,null,null,null,87,{"$f":"NA()","v":{"$error":"#N/A"}},{"$f":"NA()","v":{"$error":"#N/A"}},140,160,180,200,{"$f":"IF(AND($AC$3>=config!V52,$AC$3<config!V53),$AB$3,NA())","v":{"$error":"#N/A"}},{"$error":"#N/A"}]
[null,null,null,null,null,null,48,"2016-09-30",{"$f":"Settings!$C$11-((Settings!$C$11-Settings!$E$11)/(Settings!$E$8-Settings!$C$8)*$G53)","v":114.33013698630137},{"$f":"VLOOKUP(H53,data[],2,FALSE)","v":{"$error":"#N/A"}},{"$f":"VLOOKUP(H53,data[],12,FALSE)","v":{"$error":"#N/A"}},null,null,null,null,null,null,null,null,null,null,88,{"$f":"NA()","v":{"$error":"#N/A"}},{"$f":"NA()","v":{"$error":"#N/A"}},140,160,180,200,{"$f":"IF(AND($AC$3>=config!V53,$AC$3<config!V54),$AB$3,NA())","v":{"$error":"#N/A"}},{"$error":"#N/A"}]
[null,null,null,null,null,null,49,"2016-10-01",{"$f":"Settings!$C$11-((Settings!$C$11-Settings!$E$11)/(Settings!$E$8-Settings!$C$8)*$G54)","v":114.20993150684932},{"$f":"VLOOKUP(H54,data[],2,FALSE)","v":{"$error":"#N/A"}},{"$f":"VLOOKUP(H54,data[],12,FALSE)","v":{"$error":"#N/A"}},null,null,null,null,null,null,null,null,null,null,89,{"$f":"NA()","v":{"$error":"#N/A"}},{"$f":"NA()","v":{"$error":"#N/A"}},140,160,180,200,{"$f":"IF(AND($AC$3>=config!V54,$AC$3<config!V55),$AB$3,NA())","v":146},"My current BP: 146/89"]
[null,null,null,null,null,null,50,"2016-10-02",{"$f":"Settings!$C$11-((Settings!$C$11-Settings!$E$11)/(Settings!$E$8-Settings!$C$8)*$G55)","v":114.08972602739726},{"$f":"VLOOKUP(H55,data[],2,FALSE)","v":{"$error":"#N/A"}},{"$f":"VLOOKUP(H55,data[],12,FALSE)","v":{"$error":"#N/A"}},null,null,null,null,null,null,null,null,null,null,90,{"$f":"NA()","v":{"$error":"#N/A"}},{"$f":"NA()","v":{"$error":"#N/A"}},140,160,180,200,{"$f":"IF(AND($AC$3>=config!V55,$AC$3<config!V56),$AB$3,NA())","v":{"$error":"#N/A"}},{"$error":"#N/A"}]
[null,null,null,null,null,null,51,"2016-10-03",{"$f":"Settings!$C$11-((Settings!$C$11-Settings!$E$11)/(Settings!$E$8-Settings!$C$8)*$G56)","v":113.96952054794519},{"$f":"VLOOKUP(H56,data[],2,FALSE)","v":{"$error":"#N/A"}},{"$f":"VLOOKUP(H56,data[],12,FALSE)","v":{"$error":"#N/A"}},null,null,null,null,null,null,null,null,null,null,91,{"$f":"NA()","v":{"$error":"#N/A"}},{"$f":"NA()","v":{"$error":"#N/A"}},{"$f":"NA()","v":{"$error":"#N/A"}},160,180,200,{"$f":"IF(AND($AC$3>=config!V56,$AC$3<config!V57),$AB$3,NA())","v":{"$error":"#N/A"}},{"$error":"#N/A"}]
[null,null,null,null,null,null,52,"2016-10-04",{"$f":"Settings!$C$11-((Settings!$C$11-Settings!$E$11)/(Settings!$E$8-Settings!$C$8)*$G57)","v":113.84931506849314},{"$f":"VLOOKUP(H57,data[],2,FALSE)","v":{"$error":"#N/A"}},{"$f":"VLOOKUP(H57,data[],12,FALSE)","v":{"$error":"#N/A"}},null,null,null,null,null,null,null,null,null,null,92,{"$f":"NA()","v":{"$error":"#N/A"}},{"$f":"NA()","v":{"$error":"#N/A"}},{"$f":"NA()","v":{"$error":"#N/A"}},160,180,200,{"$f":"IF(AND($AC$3>=config!V57,$AC$3<config!V58),$AB$3,NA())","v":{"$error":"#N/A"}},{"$error":"#N/A"}]
[null,null,null,null,null,null,53,"2016-10-05",{"$f":"Settings!$C$11-((Settings!$C$11-Settings!$E$11)/(Settings!$E$8-Settings!$C$8)*$G58)","v":113.72910958904109},{"$f":"VLOOKUP(H58,data[],2,FALSE)","v":{"$error":"#N/A"}},{"$f":"VLOOKUP(H58,data[],12,FALSE)","v":{"$error":"#N/A"}},null,null,null,null,null,null,null,null,null,null,93,{"$f":"NA()","v":{"$error":"#N/A"}},{"$f":"NA()","v":{"$error":"#N/A"}},{"$f":"NA()","v":{"$error":"#N/A"}},160,180,200,{"$f":"IF(AND($AC$3>=config!V58,$AC$3<config!V59),$AB$3,NA())","v":{"$error":"#N/A"}},{"$error":"#N/A"}]
[null,null,null,null,null,null,54,"2016-10-06",{"$f":"Settings!$C$11-((Settings!$C$11-Settings!$E$11)/(Settings!$E$8-Settings!$C$8)*$G59)","v":113.60890410958903},{"$f":"VLOOKUP(H59,data[],2,FALSE)","v":{"$error":"#N/A"}},{"$f":"VLOOKUP(H59,data[],12,FALSE)","v":{"$error":"#N/A"}},null,null,null,null,null,null,null,null,null,null,94,{"$f":"NA()","v":{"$error":"#N/A"}},{"$f":"NA()","v":{"$error":"#N/A"}},{"$f":"NA()","v":{"$error":"#N/A"}},160,180,200,{"$f":"IF(AND($AC$3>=config!V59,$AC$3<config!V60),$AB$3,NA())","v":{"$error":"#N/A"}},{"$error":"#N/A"}]
[null,null,null,null,null,null,55,"2016-10-07",{"$f":"Settings!$C$11-((Settings!$C$11-Settings!$E$11)/(Settings!$E$8-Settings!$C$8)*$G60)","v":113.48869863013698},{"$f":"VLOOKUP(H60,data[],2,FALSE)","v":{"$error":"#N/A"}},{"$f":"VLOOKUP(H60,data[],12,FALSE)","v":{"$error":"#N/A"}},null,null,null,null,null,null,null,null,null,null,95,{"$f":"NA()","v":{"$error":"#N/A"}},{"$f":"NA()","v":{"$error":"#N/A"}},{"$f":"NA()","v":{"$error":"#N/A"}},160,180,200,{"$f":"IF(AND($AC$3>=config!V60,$AC$3<config!V61),$AB$3,NA())","v":{"$error":"#N/A"}},{"$error":"#N/A"}]
[null,null,null,null,null,null,56,"2016-10-08",{"$f":"Settings!$C$11-((Settings!$C$11-Settings!$E$11)/(Settings!$E$8-Settings!$C$8)*$G61)","v":113.36849315068493},{"$f":"VLOOKUP(H61,data[],2,FALSE)","v":{"$error":"#N/A"}},{"$f":"VLOOKUP(H61,data[],12,FALSE)","v":{"$error":"#N/A"}},null,null,null,null,null,null,null,null,null,null,96,{"$f":"NA()","v":{"$error":"#N/A"}},{"$f":"NA()","v":{"$error":"#N/A"}},{"$f":"NA()","v":{"$error":"#N/A"}},160,180,200,{"$f":"IF(AND($AC$3>=config!V61,$AC$3<config!V62),$AB$3,NA())","v":{"$error":"#N/A"}},{"$error":"#N/A"}]
[null,null,null,null,null,null,57,"2016-10-09",{"$f":"Settings!$C$11-((Settings!$C$11-Settings!$E$11)/(Settings!$E$8-Settings!$C$8)*$G62)","v":113.24828767123287},{"$f":"VLOOKUP(H62,data[],2,FALSE)","v":{"$error":"#N/A"}},{"$f":"VLOOKUP(H62,data[],12,FALSE)","v":{"$error":"#N/A"}},null,null,null,null,null,null,null,null,null,null,97,{"$f":"NA()","v":{"$error":"#N/A"}},{"$f":"NA()","v":{"$error":"#N/A"}},{"$f":"NA()","v":{"$error":"#N/A"}},160,180,200,{"$f":"IF(AND($AC$3>=config!V62,$AC$3<config!V63),$AB$3,NA())","v":{"$error":"#N/A"}},{"$error":"#N/A"}]
[null,null,null,null,null,null,58,"2016-10-10",{"$f":"Settings!$C$11-((Settings!$C$11-Settings!$E$11)/(Settings!$E$8-Settings!$C$8)*$G63)","v":113.12808219178082},{"$f":"VLOOKUP(H63,data[],2,FALSE)","v":{"$error":"#N/A"}},{"$f":"VLOOKUP(H63,data[],12,FALSE)","v":{"$error":"#N/A"}},null,null,null,null,null,null,null,null,null,null,98,{"$f":"NA()","v":{"$error":"#N/A"}},{"$f":"NA()","v":{"$error":"#N/A"}},{"$f":"NA()","v":{"$error":"#N/A"}},160,180,200,{"$f":"IF(AND($AC$3>=config!V63,$AC$3<config!V64),$AB$3,NA())","v":{"$error":"#N/A"}},{"$error":"#N/A"}]
[null,null,null,null,null,null,59,"2016-10-11",{"$f":"Settings!$C$11-((Settings!$C$11-Settings!$E$11)/(Settings!$E$8-Settings!$C$8)*$G64)","v":113.00787671232877},{"$f":"VLOOKUP(H64,data[],2,FALSE)","v":{"$error":"#N/A"}},{"$f":"VLOOKUP(H64,data[],12,FALSE)","v":{"$error":"#N/A"}},null,null,null,null,null,null,null,null,null,null,99,{"$f":"NA()","v":{"$error":"#N/A"}},{"$f":"NA()","v":{"$error":"#N/A"}},{"$f":"NA()","v":{"$error":"#N/A"}},160,180,200,{"$f":"IF(AND($AC$3>=config!V64,$AC$3<config!V65),$AB$3,NA())","v":{"$error":"#N/A"}},{"$error":"#N/A"}]
[null,null,null,null,null,null,60,"2016-10-12",{"$f":"Settings!$C$11-((Settings!$C$11-Settings!$E$11)/(Settings!$E$8-Settings!$C$8)*$G65)","v":112.88767123287671},{"$f":"VLOOKUP(H65,data[],2,FALSE)","v":{"$error":"#N/A"}},{"$f":"VLOOKUP(H65,data[],12,FALSE)","v":{"$error":"#N/A"}},null,null,null,null,null,null,null,null,null,null,100,{"$f":"NA()","v":{"$error":"#N/A"}},{"$f":"NA()","v":{"$error":"#N/A"}},{"$f":"NA()","v":{"$error":"#N/A"}},160,180,200,{"$f":"IF(AND($AC$3>=config!V65,$AC$3<config!V66),$AB$3,NA())","v":{"$error":"#N/A"}},{"$error":"#N/A"}]
[null,null,null,null,null,null,61,"2016-10-13",{"$f":"Settings!$C$11-((Settings!$C$11-Settings!$E$11)/(Settings!$E$8-Settings!$C$8)*$G66)","v":112.76746575342466},{"$f":"VLOOKUP(H66,data[],2,FALSE)","v":{"$error":"#N/A"}},{"$f":"VLOOKUP(H66,data[],12,FALSE)","v":{"$error":"#N/A"}},null,null,null,null,null,null,null,null,null,null,101,{"$f":"NA()","v":{"$error":"#N/A"}},{"$f":"NA()","v":{"$error":"#N/A"}},{"$f":"NA()","v":{"$error":"#N/A"}},{"$f":"NA()","v":{"$error":"#N/A"}},180,200,{"$f":"IF(AND($AC$3>=config!V66,$AC$3<config!V67),$AB$3,NA())","v":{"$error":"#N/A"}},{"$error":"#N/A"}]
[null,null,null,null,null,null,62,"2016-10-14",{"$f":"Settings!$C$11-((Settings!$C$11-Settings!$E$11)/(Settings!$E$8-Settings!$C$8)*$G67)","v":112.64726027397259},{"$f":"VLOOKUP(H67,data[],2,FALSE)","v":{"$error":"#N/A"}},{"$f":"VLOOKUP(H67,data[],12,FALSE)","v":{"$error":"#N/A"}},null,null,null,null,null,null,null,null,null,null,102,{"$f":"NA()","v":{"$error":"#N/A"}},{"$f":"NA()","v":{"$error":"#N/A"}},{"$f":"NA()","v":{"$error":"#N/A"}},{"$f":"NA()","v":{"$error":"#N/A"}},180,200,{"$f":"IF(AND($AC$3>=config!V67,$AC$3<config!V68),$AB$3,NA())","v":{"$error":"#N/A"}},{"$error":"#N/A"}]
[null,null,null,null,null,null,63,"2016-10-15",{"$f":"Settings!$C$11-((Settings!$C$11-Settings!$E$11)/(Settings!$E$8-Settings!$C$8)*$G68)","v":112.52705479452054},{"$f":"VLOOKUP(H68,data[],2,FALSE)","v":{"$error":"#N/A"}},{"$f":"VLOOKUP(H68,data[],12,FALSE)","v":{"$error":"#N/A"}},null,null,null,null,null,null,null,null,null,null,103,{"$f":"NA()","v":{"$error":"#N/A"}},{"$f":"NA()","v":{"$error":"#N/A"}},{"$f":"NA()","v":{"$error":"#N/A"}},{"$f":"NA()","v":{"$error":"#N/A"}},180,200,{"$f":"IF(AND($AC$3>=config!V68,$AC$3<config!V69),$AB$3,NA())","v":{"$error":"#N/A"}},{"$error":"#N/A"}]
[null,null,null,null,null,null,64,"2016-10-16",{"$f":"Settings!$C$11-((Settings!$C$11-Settings!$E$11)/(Settings!$E$8-Settings!$C$8)*$G69)","v":112.40684931506848},{"$f":"VLOOKUP(H69,data[],2,FALSE)","v":{"$error":"#N/A"}},{"$f":"VLOOKUP(H69,data[],12,FALSE)","v":{"$error":"#N/A"}},null,null,null,null,null,null,null,null,null,null,104,{"$f":"NA()","v":{"$error":"#N/A"}},{"$f":"NA()","v":{"$error":"#N/A"}},{"$f":"NA()","v":{"$error":"#N/A"}},{"$f":"NA()","v":{"$error":"#N/A"}},180,200,{"$f":"IF(AND($AC$3>=config!V69,$AC$3<config!V70),$AB$3,NA())","v":{"$error":"#N/A"}},{"$error":"#N/A"}]
[null,null,null,null,null,null,{"$f":"G69+1","v":65},{"$f":"H69+1","v":"2016-10-17"},{"$f":"Settings!$C$11-((Settings!$C$11-Settings!$E$11)/(Settings!$E$8-Settings!$C$8)*$G70)","v":112.28664383561643},{"$f":"VLOOKUP(H70,data[],2,FALSE)","v":{"$error":"#N/A"}},{"$f":"VLOOKUP(H70,data[],12,FALSE)","v":{"$error":"#N/A"}},null,null,null,null,null,null,null,null,null,null,105,{"$f":"NA()","v":{"$error":"#N/A"}},{"$f":"NA()","v":{"$error":"#N/A"}},{"$f":"NA()","v":{"$error":"#N/A"}},{"$f":"NA()","v":{"$error":"#N/A"}},180,200,{"$f":"IF(AND($AC$3>=config!V70,$AC$3<config!V71),$AB$3,NA())","v":{"$error":"#N/A"}},{"$f":"IF(ISERROR(AC70),NA(),\"My current BP: \"&TEXT($AB$3,\"0\")&\"/\"&TEXT($AC$3,\"0\"))","v":{"$error":"#N/A"}}]
[null,null,null,null,null,null,66,"2016-10-18",{"$f":"Settings!$C$11-((Settings!$C$11-Settings!$E$11)/(Settings!$E$8-Settings!$C$8)*$G71)","v":112.16643835616438},{"$f":"VLOOKUP(H71,data[],2,FALSE)","v":{"$error":"#N/A"}},{"$f":"VLOOKUP(H71,data[],12,FALSE)","v":{"$error":"#N/A"}},null,null,null,null,null,null,null,null,null,null,106,{"$f":"NA()","v":{"$error":"#N/A"}},{"$f":"NA()","v":{"$error":"#N/A"}},{"$f":"NA()","v":{"$error":"#N/A"}},{"$f":"NA()","v":{"$error":"#N/A"}},180,200,{"$f":"IF(AND($AC$3>=config!V71,$AC$3<config!V72),$AB$3,NA())","v":{"$error":"#N/A"}},{"$error":"#N/A"}]
[null,null,null,null,null,null,67,"2016-10-19",{"$f":"Settings!$C$11-((Settings!$C$11-Settings!$E$11)/(Settings!$E$8-Settings!$C$8)*$G72)","v":112.04623287671232},{"$f":"VLOOKUP(H72,data[],2,FALSE)","v":{"$error":"#N/A"}},{"$f":"VLOOKUP(H72,data[],12,FALSE)","v":{"$error":"#N/A"}},null,null,null,null,null,null,null,null,null,null,107,{"$f":"NA()","v":{"$error":"#N/A"}},{"$f":"NA()","v":{"$error":"#N/A"}},{"$f":"NA()","v":{"$error":"#N/A"}},{"$f":"NA()","v":{"$error":"#N/A"}},180,200,{"$f":"IF(AND($AC$3>=config!V72,$AC$3<config!V73),$AB$3,NA())","v":{"$error":"#N/A"}},{"$error":"#N/A"}]
[null,null,null,null,null,null,68,"2016-10-20",{"$f":"Settings!$C$11-((Settings!$C$11-Settings!$E$11)/(Settings!$E$8-Settings!$C$8)*$G73)","v":111.92602739726027},{"$f":"VLOOKUP(H73,data[],2,FALSE)","v":{"$error":"#N/A"}},{"$f":"VLOOKUP(H73,data[],12,FALSE)","v":{"$error":"#N/A"}},null,null,null,null,null,null,null,null,null,null,108,{"$f":"NA()","v":{"$error":"#N/A"}},{"$f":"NA()","v":{"$error":"#N/A"}},{"$f":"NA()","v":{"$error":"#N/A"}},{"$f":"NA()","v":{"$error":"#N/A"}},180,200,{"$f":"IF(AND($AC$3>=config!V73,$AC$3<config!V74),$AB$3,NA())","v":{"$error":"#N/A"}},{"$error":"#N/A"}]
[null,null,null,null,null,null,69,"2016-10-21",{"$f":"Settings!$C$11-((Settings!$C$11-Settings!$E$11)/(Settings!$E$8-Settings!$C$8)*$G74)","v":111.80582191780822},{"$f":"VLOOKUP(H74,data[],2,FALSE)","v":{"$error":"#N/A"}},{"$f":"VLOOKUP(H74,data[],12,FALSE)","v":{"$error":"#N/A"}},null,null,null,null,null,null,null,null,null,null,109,{"$f":"NA()","v":{"$error":"#N/A"}},{"$f":"NA()","v":{"$error":"#N/A"}},{"$f":"NA()","v":{"$error":"#N/A"}},{"$f":"NA()","v":{"$error":"#N/A"}},180,200,{"$f":"IF(AND($AC$3>=config!V74,$AC$3<config!V75),$AB$3,NA())","v":{"$error":"#N/A"}},{"$error":"#N/A"}]
[null,null,null,null,null,null,70,"2016-10-22",{"$f":"Settings!$C$11-((Settings!$C$11-Settings!$E$11)/(Settings!$E$8-Settings!$C$8)*$G75)","v":111.68561643835616},{"$f":"VLOOKUP(H75,data[],2,FALSE)","v":{"$error":"#N/A"}},{"$f":"VLOOKUP(H75,data[],12,FALSE)","v":{"$error":"#N/A"}},null,null,null,null,null,null,null,null,null,null,110,{"$f":"NA()","v":{"$error":"#N/A"}},{"$f":"NA()","v":{"$error":"#N/A"}},{"$f":"NA()","v":{"$error":"#N/A"}},{"$f":"NA()","v":{"$error":"#N/A"}},180,200,{"$f":"IF(AND($AC$3>=config!V75,$AC$3<config!V76),$AB$3,NA())","v":{"$error":"#N/A"}},{"$error":"#N/A"}]
[null,null,null,null,null,null,71,"2016-10-23",{"$f":"Settings!$C$11-((Settings!$C$11-Settings!$E$11)/(Settings!$E$8-Settings!$C$8)*$G76)","v":111.56541095890411},{"$f":"VLOOKUP(H76,data[],2,FALSE)","v":{"$error":"#N/A"}},{"$f":"VLOOKUP(H76,data[],12,FALSE)","v":{"$error":"#N/A"}},null,null,null,null,null,null,null,null,null,null,111,{"$f":"NA()","v":{"$error":"#N/A"}},{"$f":"NA()","v":{"$error":"#N/A"}},{"$f":"NA()","v":{"$error":"#N/A"}},{"$f":"NA()","v":{"$error":"#N/A"}},{"$f":"NA()","v":{"$error":"#N/A"}},200,{"$f":"IF(AND($AC$3>=config!V76,$AC$3<config!V77),$AB$3,NA())","v":{"$error":"#N/A"}},{"$error":"#N/A"}]
[null,null,null,null,null,null,72,"2016-10-24",{"$f":"Settings!$C$11-((Settings!$C$11-Settings!$E$11)/(Settings!$E$8-Settings!$C$8)*$G77)","v":111.44520547945206},{"$f":"VLOOKUP(H77,data[],2,FALSE)","v":{"$error":"#N/A"}},{"$f":"VLOOKUP(H77,data[],12,FALSE)","v":{"$error":"#N/A"}},null,null,null,null,null,null,null,null,null,null,112,{"$f":"NA()","v":{"$error":"#N/A"}},{"$f":"NA()","v":{"$error":"#N/A"}},{"$f":"NA()","v":{"$error":"#N/A"}},{"$f":"NA()","v":{"$error":"#N/A"}},{"$f":"NA()","v":{"$error":"#N/A"}},200,{"$f":"IF(AND($AC$3>=config!V77,$AC$3<config!V78),$AB$3,NA())","v":{"$error":"#N/A"}},{"$error":"#N/A"}]
[null,null,null,null,null,null,73,"2016-10-25",{"$f":"Settings!$C$11-((Settings!$C$11-Settings!$E$11)/(Settings!$E$8-Settings!$C$8)*$G78)","v":111.32499999999999},{"$f":"VLOOKUP(H78,data[],2,FALSE)","v":{"$error":"#N/A"}},{"$f":"VLOOKUP(H78,data[],12,FALSE)","v":{"$error":"#N/A"}},null,null,null,null,null,null,null,null,null,null,113,{"$f":"NA()","v":{"$error":"#N/A"}},{"$f":"NA()","v":{"$error":"#N/A"}},{"$f":"NA()","v":{"$error":"#N/A"}},{"$f":"NA()","v":{"$error":"#N/A"}},{"$f":"NA()","v":{"$error":"#N/A"}},200,{"$f":"IF(AND($AC$3>=config!V78,$AC$3<config!V79),$AB$3,NA())","v":{"$error":"#N/A"}},{"$error":"#N/A"}]
[null,null,null,null,null,null,74,"2016-10-26",{"$f":"Settings!$C$11-((Settings!$C$11-Settings!$E$11)/(Settings!$E$8-Settings!$C$8)*$G79)","v":111.20479452054794},{"$f":"VLOOKUP(H79,data[],2,FALSE)","v":{"$error":"#N/A"}},{"$f":"VLOOKUP(H79,data[],12,FALSE)","v":{"$error":"#N/A"}},null,null,null,null,null,null,null,null,null,null,114,{"$f":"NA()","v":{"$error":"#N/A"}},{"$f":"NA()","v":{"$error":"#N/A"}},{"$f":"NA()","v":{"$error":"#N/A"}},{"$f":"NA()","v":{"$error":"#N/A"}},{"$f":"NA()","v":{"$error":"#N/A"}},200,{"$f":"IF(AND($AC$3>=config!V79,$AC$3<config!V80),$AB$3,NA())","v":{"$error":"#N/A"}},{"$error":"#N/A"}]
[null,null,null,null,null,null,75,"2016-10-27",{"$f":"Settings!$C$11-((Settings!$C$11-Settings!$E$11)/(Settings!$E$8-Settings!$C$8)*$G80)","v":111.08458904109588},{"$f":"VLOOKUP(H80,data[],2,FALSE)","v":{"$error":"#N/A"}},{"$f":"VLOOKUP(H80,data[],12,FALSE)","v":{"$error":"#N/A"}},null,null,null,null,null,null,null,null,null,null,115,{"$f":"NA()","v":{"$error":"#N/A"}},{"$f":"NA()","v":{"$error":"#N/A"}},{"$f":"NA()","v":{"$error":"#N/A"}},{"$f":"NA()","v":{"$error":"#N/A"}},{"$f":"NA()","v":{"$error":"#N/A"}},200,{"$f":"IF(AND($AC$3>=config!V80,$AC$3<config!V81),$AB$3,NA())","v":{"$error":"#N/A"}},{"$error":"#N/A"}]
[null,null,null,null,null,null,76,"2016-10-28",{"$f":"Settings!$C$11-((Settings!$C$11-Settings!$E$11)/(Settings!$E$8-Settings!$C$8)*$G81)","v":110.96438356164383},{"$f":"VLOOKUP(H81,data[],2,FALSE)","v":{"$error":"#N/A"}},{"$f":"VLOOKUP(H81,data[],12,FALSE)","v":{"$error":"#N/A"}},null,null,null,null,null,null,null,null,null,null,116,{"$f":"NA()","v":{"$error":"#N/A"}},{"$f":"NA()","v":{"$error":"#N/A"}},{"$f":"NA()","v":{"$error":"#N/A"}},{"$f":"NA()","v":{"$error":"#N/A"}},{"$f":"NA()","v":{"$error":"#N/A"}},200,{"$f":"IF(AND($AC$3>=config!V81,$AC$3<config!V82),$AB$3,NA())","v":{"$error":"#N/A"}},{"$error":"#N/A"}]
[null,null,null,null,null,null,77,"2016-10-29",{"$f":"Settings!$C$11-((Settings!$C$11-Settings!$E$11)/(Settings!$E$8-Settings!$C$8)*$G82)","v":110.84417808219177},{"$f":"VLOOKUP(H82,data[],2,FALSE)","v":{"$error":"#N/A"}},{"$f":"VLOOKUP(H82,data[],12,FALSE)","v":{"$error":"#N/A"}},null,null,null,null,null,null,null,null,null,null,117,{"$f":"NA()","v":{"$error":"#N/A"}},{"$f":"NA()","v":{"$error":"#N/A"}},{"$f":"NA()","v":{"$error":"#N/A"}},{"$f":"NA()","v":{"$error":"#N/A"}},{"$f":"NA()","v":{"$error":"#N/A"}},200,{"$f":"IF(AND($AC$3>=config!V82,$AC$3<config!V83),$AB$3,NA())","v":{"$error":"#N/A"}},{"$error":"#N/A"}]
[null,null,null,null,null,null,78,"2016-10-30",{"$f":"Settings!$C$11-((Settings!$C$11-Settings!$E$11)/(Settings!$E$8-Settings!$C$8)*$G83)","v":110.72397260273972},{"$f":"VLOOKUP(H83,data[],2,FALSE)","v":{"$error":"#N/A"}},{"$f":"VLOOKUP(H83,data[],12,FALSE)","v":{"$error":"#N/A"}},null,null,null,null,null,null,null,null,null,null,118,{"$f":"NA()","v":{"$error":"#N/A"}},{"$f":"NA()","v":{"$error":"#N/A"}},{"$f":"NA()","v":{"$error":"#N/A"}},{"$f":"NA()","v":{"$error":"#N/A"}},{"$f":"NA()","v":{"$error":"#N/A"}},200,{"$f":"IF(AND($AC$3>=config!V83,$AC$3<config!V84),$AB$3,NA())","v":{"$error":"#N/A"}},{"$error":"#N/A"}]
[null,null,null,null,null,null,79,"2016-10-31",{"$f":"Settings!$C$11-((Settings!$C$11-Settings!$E$11)/(Settings!$E$8-Settings!$C$8)*$G84)","v":110.60376712328767},{"$f":"VLOOKUP(H84,data[],2,FALSE)","v":{"$error":"#N/A"}},{"$f":"VLOOKUP(H84,data[],12,FALSE)","v":{"$error":"#N/A"}},null,null,null,null,null,null,null,null,null,null,119,{"$f":"NA()","v":{"$error":"#N/A"}},{"$f":"NA()","v":{"$error":"#N/A"}},{"$f":"NA()","v":{"$error":"#N/A"}},{"$f":"NA()","v":{"$error":"#N/A"}},{"$f":"NA()","v":{"$error":"#N/A"}},200,{"$f":"IF(AND($AC$3>=config!V84,$AC$3<config!V85),$AB$3,NA())","v":{"$error":"#N/A"}},{"$error":"#N/A"}]
[null,null,null,null,null,null,80,"2016-11-01",{"$f":"Settings!$C$11-((Settings!$C$11-Settings!$E$11)/(Settings!$E$8-Settings!$C$8)*$G85)","v":110.48356164383561},{"$f":"VLOOKUP(H85,data[],2,FALSE)","v":{"$error":"#N/A"}},{"$f":"VLOOKUP(H85,data[],12,FALSE)","v":{"$error":"#N/A"}},null,null,null,null,null,null,null,null,null,null,120,{"$f":"NA()","v":{"$error":"#N/A"}},{"$f":"NA()","v":{"$error":"#N/A"}},{"$f":"NA()","v":{"$error":"#N/A"}},{"$f":"NA()","v":{"$error":"#N/A"}},{"$f":"NA()","v":{"$error":"#N/A"}},200,{"$f":"IF(AND($AC$3>=config!V85,$AC$3<config!V86),$AB$3,NA())","v":{"$error":"#N/A"}},{"$error":"#N/A"}]
[null,null,null,null,null,null,81,"2016-11-02",{"$f":"Settings!$C$11-((Settings!$C$11-Settings!$E$11)/(Settings!$E$8-Settings!$C$8)*$G86)","v":110.36335616438356},{"$f":"VLOOKUP(H86,data[],2,FALSE)","v":{"$error":"#N/A"}},{"$f":"VLOOKUP(H86,data[],12,FALSE)","v":{"$error":"#N/A"}}]
[null,null,null,null,null,null,82,"2016-11-03",{"$f":"Settings!$C$11-((Settings!$C$11-Settings!$E$11)/(Settings!$E$8-Settings!$C$8)*$G87)","v":110.24315068493151},{"$f":"VLOOKUP(H87,data[],2,FALSE)","v":{"$error":"#N/A"}},{"$f":"VLOOKUP(H87,data[],12,FALSE)","v":{"$error":"#N/A"}}]
[null,null,null,null,null,null,83,"2016-11-04",{"$f":"Settings!$C$11-((Settings!$C$11-Settings!$E$11)/(Settings!$E$8-Settings!$C$8)*$G88)","v":110.12294520547945},{"$f":"VLOOKUP(H88,data[],2,FALSE)","v":{"$error":"#N/A"}},{"$f":"VLOOKUP(H88,data[],12,FALSE)","v":{"$error":"#N/A"}}]
[null,null,null,null,null,null,84,"2016-11-05",{"$f":"Settings!$C$11-((Settings!$C$11-Settings!$E$11)/(Settings!$E$8-Settings!$C$8)*$G89)","v":110.00273972602739},{"$f":"VLOOKUP(H89,data[],2,FALSE)","v":{"$error":"#N/A"}},{"$f":"VLOOKUP(H89,data[],12,FALSE)","v":{"$error":"#N/A"}}]
[null,null,null,null,null,null,85,"2016-11-06",{"$f":"Settings!$C$11-((Settings!$C$11-Settings!$E$11)/(Settings!$E$8-Settings!$C$8)*$G90)","v":109.88253424657535},{"$f":"VLOOKUP(H90,data[],2,FALSE)","v":{"$error":"#N/A"}},{"$f":"VLOOKUP(H90,data[],12,FALSE)","v":{"$error":"#N/A"}}]
[null,null,null,null,null,null,86,"2016-11-07",{"$f":"Settings!$C$11-((Settings!$C$11-Settings!$E$11)/(Settings!$E$8-Settings!$C$8)*$G91)","v":109.76232876712328},{"$f":"VLOOKUP(H91,data[],2,FALSE)","v":{"$error":"#N/A"}},{"$f":"VLOOKUP(H91,data[],12,FALSE)","v":{"$error":"#N/A"}}]
[null,null,null,null,null,null,87,"2016-11-08",{"$f":"Settings!$C$11-((Settings!$C$11-Settings!$E$11)/(Settings!$E$8-Settings!$C$8)*$G92)","v":109.64212328767123},{"$f":"VLOOKUP(H92,data[],2,FALSE)","v":{"$error":"#N/A"}},{"$f":"VLOOKUP(H92,data[],12,FALSE)","v":{"$error":"#N/A"}}]
[null,null,null,null,null,null,88,"2016-11-09",{"$f":"Settings!$C$11-((Settings!$C$11-Settings!$E$11)/(Settings!$E$8-Settings!$C$8)*$G93)","v":109.52191780821917},{"$f":"VLOOKUP(H93,data[],2,FALSE)","v":{"$error":"#N/A"}},{"$f":"VLOOKUP(H93,data[],12,FALSE)","v":{"$error":"#N/A"}}]
[null,null,null,null,null,null,89,"2016-11-10",{"$f":"Settings!$C$11-((Settings!$C$11-Settings!$E$11)/(Settings!$E$8-Settings!$C$8)*$G94)","v":109.40171232876712},{"$f":"VLOOKUP(H94,data[],2,FALSE)","v":{"$error":"#N/A"}},{"$f":"VLOOKUP(H94,data[],12,FALSE)","v":{"$error":"#N/A"}}]
[null,null,null,null,null,null,90,"2016-11-11",{"$f":"Settings!$C$11-((Settings!$C$11-Settings!$E$11)/(Settings!$E$8-Settings!$C$8)*$G95)","v":109.28150684931506},{"$f":"VLOOKUP(H95,data[],2,FALSE)","v":{"$error":"#N/A"}},{"$f":"VLOOKUP(H95,data[],12,FALSE)","v":{"$error":"#N/A"}}]
[null,null,null,null,null,null,91,"2016-11-12",{"$f":"Settings!$C$11-((Settings!$C$11-Settings!$E$11)/(Settings!$E$8-Settings!$C$8)*$G96)","v":109.16130136986301},{"$f":"VLOOKUP(H96,data[],2,FALSE)","v":{"$error":"#N/A"}},{"$f":"VLOOKUP(H96,data[],12,FALSE)","v":{"$error":"#N/A"}}]
[null,null,null,null,null,null,92,"2016-11-13",{"$f":"Settings!$C$11-((Settings!$C$11-Settings!$E$11)/(Settings!$E$8-Settings!$C$8)*$G97)","v":109.04109589041096},{"$f":"VLOOKUP(H97,data[],2,FALSE)","v":{"$error":"#N/A"}},{"$f":"VLOOKUP(H97,data[],12,FALSE)","v":{"$error":"#N/A"}}]
[null,null,null,null,null,null,93,"2016-11-14",{"$f":"Settings!$C$11-((Settings!$C$11-Settings!$E$11)/(Settings!$E$8-Settings!$C$8)*$G98)","v":108.9208904109589},{"$f":"VLOOKUP(H98,data[],2,FALSE)","v":{"$error":"#N/A"}},{"$f":"VLOOKUP(H98,data[],12,FALSE)","v":{"$error":"#N/A"}}]
[null,null,null,null,null,null,94,"2016-11-15",{"$f":"Settings!$C$11-((Settings!$C$11-Settings!$E$11)/(Settings!$E$8-Settings!$C$8)*$G99)","v":108.80068493150685},{"$f":"VLOOKUP(H99,data[],2,FALSE)","v":{"$error":"#N/A"}},{"$f":"VLOOKUP(H99,data[],12,FALSE)","v":{"$error":"#N/A"}}]
[null,null,null,null,null,null,95,"2016-11-16",{"$f":"Settings!$C$11-((Settings!$C$11-Settings!$E$11)/(Settings!$E$8-Settings!$C$8)*$G100)","v":108.68047945205478},{"$f":"VLOOKUP(H100,data[],2,FALSE)","v":{"$error":"#N/A"}},{"$f":"VLOOKUP(H100,data[],12,FALSE)","v":{"$error":"#N/A"}}]
[null,null,null,null,null,null,96,"2016-11-17",{"$f":"Settings!$C$11-((Settings!$C$11-Settings!$E$11)/(Settings!$E$8-Settings!$C$8)*$G101)","v":108.56027397260274},{"$f":"VLOOKUP(H101,data[],2,FALSE)","v":{"$error":"#N/A"}},{"$f":"VLOOKUP(H101,data[],12,FALSE)","v":{"$error":"#N/A"}}]
[null,null,null,null,null,null,97,"2016-11-18",{"$f":"Settings!$C$11-((Settings!$C$11-Settings!$E$11)/(Settings!$E$8-Settings!$C$8)*$G102)","v":108.44006849315068},{"$f":"VLOOKUP(H102,data[],2,FALSE)","v":{"$error":"#N/A"}},{"$f":"VLOOKUP(H102,data[],12,FALSE)","v":{"$error":"#N/A"}}]
[null,null,null,null,null,null,98,"2016-11-19",{"$f":"Settings!$C$11-((Settings!$C$11-Settings!$E$11)/(Settings!$E$8-Settings!$C$8)*$G103)","v":108.31986301369862},{"$f":"VLOOKUP(H103,data[],2,FALSE)","v":{"$error":"#N/A"}},{"$f":"VLOOKUP(H103,data[],12,FALSE)","v":{"$error":"#N/A"}}]
[null,null,null,null,null,null,99,"2016-11-20",{"$f":"Settings!$C$11-((Settings!$C$11-Settings!$E$11)/(Settings!$E$8-Settings!$C$8)*$G104)","v":108.19965753424657},{"$f":"VLOOKUP(H104,data[],2,FALSE)","v":{"$error":"#N/A"}},{"$f":"VLOOKUP(H104,data[],12,FALSE)","v":{"$error":"#N/A"}}]
[null,null,null,null,null,null,100,"2016-11-21",{"$f":"Settings!$C$11-((Settings!$C$11-Settings!$E$11)/(Settings!$E$8-Settings!$C$8)*$G105)","v":108.07945205479452},{"$f":"VLOOKUP(H105,data[],2,FALSE)","v":{"$error":"#N/A"}},{"$f":"VLOOKUP(H105,data[],12,FALSE)","v":{"$error":"#N/A"}}]
[null,null,null,null,null,null,101,"2016-11-22",{"$f":"Settings!$C$11-((Settings!$C$11-Settings!$E$11)/(Settings!$E$8-Settings!$C$8)*$G106)","v":107.95924657534246},{"$f":"VLOOKUP(H106,data[],2,FALSE)","v":{"$error":"#N/A"}},{"$f":"VLOOKUP(H106,data[],12,FALSE)","v":{"$error":"#N/A"}}]
[null,null,null,null,null,null,102,"2016-11-23",{"$f":"Settings!$C$11-((Settings!$C$11-Settings!$E$11)/(Settings!$E$8-Settings!$C$8)*$G107)","v":107.83904109589041},{"$f":"VLOOKUP(H107,data[],2,FALSE)","v":{"$error":"#N/A"}},{"$f":"VLOOKUP(H107,data[],12,FALSE)","v":{"$error":"#N/A"}}]
[null,null,null,null,null,null,103,"2016-11-24",{"$f":"Settings!$C$11-((Settings!$C$11-Settings!$E$11)/(Settings!$E$8-Settings!$C$8)*$G108)","v":107.71883561643835},{"$f":"VLOOKUP(H108,data[],2,FALSE)","v":{"$error":"#N/A"}},{"$f":"VLOOKUP(H108,data[],12,FALSE)","v":{"$error":"#N/A"}}]
[null,null,null,null,null,null,104,"2016-11-25",{"$f":"Settings!$C$11-((Settings!$C$11-Settings!$E$11)/(Settings!$E$8-Settings!$C$8)*$G109)","v":107.5986301369863},{"$f":"VLOOKUP(H109,data[],2,FALSE)","v":{"$error":"#N/A"}},{"$f":"VLOOKUP(H109,data[],12,FALSE)","v":{"$error":"#N/A"}}]
[null,null,null,null,null,null,105,"2016-11-26",{"$f":"Settings!$C$11-((Settings!$C$11-Settings!$E$11)/(Settings!$E$8-Settings!$C$8)*$G110)","v":107.47842465753425},{"$f":"VLOOKUP(H110,data[],2,FALSE)","v":{"$error":"#N/A"}},{"$f":"VLOOKUP(H110,data[],12,FALSE)","v":{"$error":"#N/A"}}]
[null,null,null,null,null,null,106,"2016-11-27",{"$f":"Settings!$C$11-((Settings!$C$11-Settings!$E$11)/(Settings!$E$8-Settings!$C$8)*$G111)","v":107.35821917808219},{"$f":"VLOOKUP(H111,data[],2,FALSE)","v":{"$error":"#N/A"}},{"$f":"VLOOKUP(H111,data[],12,FALSE)","v":{"$error":"#N/A"}}]
[null,null,null,null,null,null,107,"2016-11-28",{"$f":"Settings!$C$11-((Settings!$C$11-Settings!$E$11)/(Settings!$E$8-Settings!$C$8)*$G112)","v":107.23801369863014},{"$f":"VLOOKUP(H112,data[],2,FALSE)","v":{"$error":"#N/A"}},{"$f":"VLOOKUP(H112,data[],12,FALSE)","v":{"$error":"#N/A"}}]
[null,null,null,null,null,null,108,"2016-11-29",{"$f":"Settings!$C$11-((Settings!$C$11-Settings!$E$11)/(Settings!$E$8-Settings!$C$8)*$G113)","v":107.11780821917807},{"$f":"VLOOKUP(H113,data[],2,FALSE)","v":{"$error":"#N/A"}},{"$f":"VLOOKUP(H113,data[],12,FALSE)","v":{"$error":"#N/A"}}]
[null,null,null,null,null,null,109,"2016-11-30",{"$f":"Settings!$C$11-((Settings!$C$11-Settings!$E$11)/(Settings!$E$8-Settings!$C$8)*$G114)","v":106.99760273972602},{"$f":"VLOOKUP(H114,data[],2,FALSE)","v":{"$error":"#N/A"}},{"$f":"VLOOKUP(H114,data[],12,FALSE)","v":{"$error":"#N/A"}}]
[null,null,null,null,null,null,110,"2016-12-01",{"$f":"Settings!$C$11-((Settings!$C$11-Settings!$E$11)/(Settings!$E$8-Settings!$C$8)*$G115)","v":106.87739726027397},{"$f":"VLOOKUP(H115,data[],2,FALSE)","v":{"$error":"#N/A"}},{"$f":"VLOOKUP(H115,data[],12,FALSE)","v":{"$error":"#N/A"}}]
[null,null,null,null,null,null,111,"2016-12-02",{"$f":"Settings!$C$11-((Settings!$C$11-Settings!$E$11)/(Settings!$E$8-Settings!$C$8)*$G116)","v":106.75719178082191},{"$f":"VLOOKUP(H116,data[],2,FALSE)","v":{"$error":"#N/A"}},{"$f":"VLOOKUP(H116,data[],12,FALSE)","v":{"$error":"#N/A"}}]
[null,null,null,null,null,null,112,"2016-12-03",{"$f":"Settings!$C$11-((Settings!$C$11-Settings!$E$11)/(Settings!$E$8-Settings!$C$8)*$G117)","v":106.63698630136986},{"$f":"VLOOKUP(H117,data[],2,FALSE)","v":{"$error":"#N/A"}},{"$f":"VLOOKUP(H117,data[],12,FALSE)","v":{"$error":"#N/A"}}]
[null,null,null,null,null,null,113,"2016-12-04",{"$f":"Settings!$C$11-((Settings!$C$11-Settings!$E$11)/(Settings!$E$8-Settings!$C$8)*$G118)","v":106.51678082191781},{"$f":"VLOOKUP(H118,data[],2,FALSE)","v":{"$error":"#N/A"}},{"$f":"VLOOKUP(H118,data[],12,FALSE)","v":{"$error":"#N/A"}}]
[null,null,null,null,null,null,114,"2016-12-05",{"$f":"Settings!$C$11-((Settings!$C$11-Settings!$E$11)/(Settings!$E$8-Settings!$C$8)*$G119)","v":106.39657534246575},{"$f":"VLOOKUP(H119,data[],2,FALSE)","v":{"$error":"#N/A"}},{"$f":"VLOOKUP(H119,data[],12,FALSE)","v":{"$error":"#N/A"}}]
[null,null,null,null,null,null,115,"2016-12-06",{"$f":"Settings!$C$11-((Settings!$C$11-Settings!$E$11)/(Settings!$E$8-Settings!$C$8)*$G120)","v":106.2763698630137},{"$f":"VLOOKUP(H120,data[],2,FALSE)","v":{"$error":"#N/A"}},{"$f":"VLOOKUP(H120,data[],12,FALSE)","v":{"$error":"#N/A"}}]
[null,null,null,null,null,null,116,"2016-12-07",{"$f":"Settings!$C$11-((Settings!$C$11-Settings!$E$11)/(Settings!$E$8-Settings!$C$8)*$G121)","v":106.15616438356165},{"$f":"VLOOKUP(H121,data[],2,FALSE)","v":{"$error":"#N/A"}},{"$f":"VLOOKUP(H121,data[],12,FALSE)","v":{"$error":"#N/A"}}]
[null,null,null,null,null,null,117,"2016-12-08",{"$f":"Settings!$C$11-((Settings!$C$11-Settings!$E$11)/(Settings!$E$8-Settings!$C$8)*$G122)","v":106.03595890410959},{"$f":"VLOOKUP(H122,data[],2,FALSE)","v":{"$error":"#N/A"}},{"$f":"VLOOKUP(H122,data[],12,FALSE)","v":{"$error":"#N/A"}}]
[null,null,null,null,null,null,118,"2016-12-09",{"$f":"Settings!$C$11-((Settings!$C$11-Settings!$E$11)/(Settings!$E$8-Settings!$C$8)*$G123)","v":105.91575342465754},{"$f":"VLOOKUP(H123,data[],2,FALSE)","v":{"$error":"#N/A"}},{"$f":"VLOOKUP(H123,data[],12,FALSE)","v":{"$error":"#N/A"}}]
[null,null,null,null,null,null,119,"2016-12-10",{"$f":"Settings!$C$11-((Settings!$C$11-Settings!$E$11)/(Settings!$E$8-Settings!$C$8)*$G124)","v":105.79554794520547},{"$f":"VLOOKUP(H124,data[],2,FALSE)","v":{"$error":"#N/A"}},{"$f":"VLOOKUP(H124,data[],12,FALSE)","v":{"$error":"#N/A"}}]
[null,null,null,null,null,null,120,"2016-12-11",{"$f":"Settings!$C$11-((Settings!$C$11-Settings!$E$11)/(Settings!$E$8-Settings!$C$8)*$G125)","v":105.67534246575342},{"$f":"VLOOKUP(H125,data[],2,FALSE)","v":{"$error":"#N/A"}},{"$f":"VLOOKUP(H125,data[],12,FALSE)","v":{"$error":"#N/A"}}]
[null,null,null,null,null,null,121,"2016-12-12",{"$f":"Settings!$C$11-((Settings!$C$11-Settings!$E$11)/(Settings!$E$8-Settings!$C$8)*$G126)","v":105.55513698630136},{"$f":"VLOOKUP(H126,data[],2,FALSE)","v":{"$error":"#N/A"}},{"$f":"VLOOKUP(H126,data[],12,FALSE)","v":{"$error":"#N/A"}}]
[null,null,null,null,null,null,122,"2016-12-13",{"$f":"Settings!$C$11-((Settings!$C$11-Settings!$E$11)/(Settings!$E$8-Settings!$C$8)*$G127)","v":105.43493150684931},{"$f":"VLOOKUP(H127,data[],2,FALSE)","v":{"$error":"#N/A"}},{"$f":"VLOOKUP(H127,data[],12,FALSE)","v":{"$error":"#N/A"}}]
[null,null,null,null,null,null,123,"2016-12-14",{"$f":"Settings!$C$11-((Settings!$C$11-Settings!$E$11)/(Settings!$E$8-Settings!$C$8)*$G128)","v":105.31472602739726},{"$f":"VLOOKUP(H128,data[],2,FALSE)","v":{"$error":"#N/A"}},{"$f":"VLOOKUP(H128,data[],12,FALSE)","v":{"$error":"#N/A"}}]
[null,null,null,null,null,null,124,"2016-12-15",{"$f":"Settings!$C$11-((Settings!$C$11-Settings!$E$11)/(Settings!$E$8-Settings!$C$8)*$G129)","v":105.1945205479452},{"$f":"VLOOKUP(H129,data[],2,FALSE)","v":{"$error":"#N/A"}},{"$f":"VLOOKUP(H129,data[],12,FALSE)","v":{"$error":"#N/A"}}]
[null,null,null,null,null,null,125,"2016-12-16",{"$f":"Settings!$C$11-((Settings!$C$11-Settings!$E$11)/(Settings!$E$8-Settings!$C$8)*$G130)","v":105.07431506849315},{"$f":"VLOOKUP(H130,data[],2,FALSE)","v":{"$error":"#N/A"}},{"$f":"VLOOKUP(H130,data[],12,FALSE)","v":{"$error":"#N/A"}}]
[null,null,null,null,null,null,126,"2016-12-17",{"$f":"Settings!$C$11-((Settings!$C$11-Settings!$E$11)/(Settings!$E$8-Settings!$C$8)*$G131)","v":104.9541095890411},{"$f":"VLOOKUP(H131,data[],2,FALSE)","v":{"$error":"#N/A"}},{"$f":"VLOOKUP(H131,data[],12,FALSE)","v":{"$error":"#N/A"}}]
[null,null,null,null,null,null,127,"2016-12-18",{"$f":"Settings!$C$11-((Settings!$C$11-Settings!$E$11)/(Settings!$E$8-Settings!$C$8)*$G132)","v":104.83390410958904},{"$f":"VLOOKUP(H132,data[],2,FALSE)","v":{"$error":"#N/A"}},{"$f":"VLOOKUP(H132,data[],12,FALSE)","v":{"$error":"#N/A"}}]
[null,null,null,null,null,null,128,"2016-12-19",{"$f":"Settings!$C$11-((Settings!$C$11-Settings!$E$11)/(Settings!$E$8-Settings!$C$8)*$G133)","v":104.71369863013699},{"$f":"VLOOKUP(H133,data[],2,FALSE)","v":{"$error":"#N/A"}},{"$f":"VLOOKUP(H133,data[],12,FALSE)","v":{"$error":"#N/A"}}]
[null,null,null,null,null,null,{"$f":"G133+1","v":129},{"$f":"H133+1","v":"2016-12-20"},{"$f":"Settings!$C$11-((Settings!$C$11-Settings!$E$11)/(Settings!$E$8-Settings!$C$8)*$G134)","v":104.59349315068494},{"$f":"VLOOKUP(H134,data[],2,FALSE)","v":{"$error":"#N/A"}},{"$f":"VLOOKUP(H134,data[],12,FALSE)","v":{"$error":"#N/A"}}]
[null,null,null,null,null,null,130,"2016-12-21",{"$f":"Settings!$C$11-((Settings!$C$11-Settings!$E$11)/(Settings!$E$8-Settings!$C$8)*$G135)","v":104.47328767123287},{"$f":"VLOOKUP(H135,data[],2,FALSE)","v":{"$error":"#N/A"}},{"$f":"VLOOKUP(H135,data[],12,FALSE)","v":{"$error":"#N/A"}}]
[null,null,null,null,null,null,131,"2016-12-22",{"$f":"Settings!$C$11-((Settings!$C$11-Settings!$E$11)/(Settings!$E$8-Settings!$C$8)*$G136)","v":104.35308219178081},{"$f":"VLOOKUP(H136,data[],2,FALSE)","v":{"$error":"#N/A"}},{"$f":"VLOOKUP(H136,data[],12,FALSE)","v":{"$error":"#N/A"}}]
[null,null,null,null,null,null,132,"2016-12-23",{"$f":"Settings!$C$11-((Settings!$C$11-Settings!$E$11)/(Settings!$E$8-Settings!$C$8)*$G137)","v":104.23287671232876},{"$f":"VLOOKUP(H137,data[],2,FALSE)","v":{"$error":"#N/A"}},{"$f":"VLOOKUP(H137,data[],12,FALSE)","v":{"$error":"#N/A"}}]
[null,null,null,null,null,null,133,"2016-12-24",{"$f":"Settings!$C$11-((Settings!$C$11-Settings!$E$11)/(Settings!$E$8-Settings!$C$8)*$G138)","v":104.11267123287671},{"$f":"VLOOKUP(H138,data[],2,FALSE)","v":{"$error":"#N/A"}},{"$f":"VLOOKUP(H138,data[],12,FALSE)","v":{"$error":"#N/A"}}]
[null,null,null,null,null,null,134,"2016-12-25",{"$f":"Settings!$C$11-((Settings!$C$11-Settings!$E$11)/(Settings!$E$8-Settings!$C$8)*$G139)","v":103.99246575342465},{"$f":"VLOOKUP(H139,data[],2,FALSE)","v":{"$error":"#N/A"}},{"$f":"VLOOKUP(H139,data[],12,FALSE)","v":{"$error":"#N/A"}}]
[null,null,null,null,null,null,135,"2016-12-26",{"$f":"Settings!$C$11-((Settings!$C$11-Settings!$E$11)/(Settings!$E$8-Settings!$C$8)*$G140)","v":103.8722602739726},{"$f":"VLOOKUP(H140,data[],2,FALSE)","v":{"$error":"#N/A"}},{"$f":"VLOOKUP(H140,data[],12,FALSE)","v":{"$error":"#N/A"}}]
[null,null,null,null,null,null,136,"2016-12-27",{"$f":"Settings!$C$11-((Settings!$C$11-Settings!$E$11)/(Settings!$E$8-Settings!$C$8)*$G141)","v":103.75205479452055},{"$f":"VLOOKUP(H141,data[],2,FALSE)","v":{"$error":"#N/A"}},{"$f":"VLOOKUP(H141,data[],12,FALSE)","v":{"$error":"#N/A"}}]
[null,null,null,null,null,null,137,"2016-12-28",{"$f":"Settings!$C$11-((Settings!$C$11-Settings!$E$11)/(Settings!$E$8-Settings!$C$8)*$G142)","v":103.63184931506849},{"$f":"VLOOKUP(H142,data[],2,FALSE)","v":{"$error":"#N/A"}},{"$f":"VLOOKUP(H142,data[],12,FALSE)","v":{"$error":"#N/A"}}]
[null,null,null,null,null,null,138,"2016-12-29",{"$f":"Settings!$C$11-((Settings!$C$11-Settings!$E$11)/(Settings!$E$8-Settings!$C$8)*$G143)","v":103.51164383561644},{"$f":"VLOOKUP(H143,data[],2,FALSE)","v":{"$error":"#N/A"}},{"$f":"VLOOKUP(H143,data[],12,FALSE)","v":{"$error":"#N/A"}}]
[null,null,null,null,null,null,139,"2016-12-30",{"$f":"Settings!$C$11-((Settings!$C$11-Settings!$E$11)/(Settings!$E$8-Settings!$C$8)*$G144)","v":103.39143835616439},{"$f":"VLOOKUP(H144,data[],2,FALSE)","v":{"$error":"#N/A"}},{"$f":"VLOOKUP(H144,data[],12,FALSE)","v":{"$error":"#N/A"}}]
[null,null,null,null,null,null,140,"2016-12-31",{"$f":"Settings!$C$11-((Settings!$C$11-Settings!$E$11)/(Settings!$E$8-Settings!$C$8)*$G145)","v":103.27123287671233},{"$f":"VLOOKUP(H145,data[],2,FALSE)","v":{"$error":"#N/A"}},{"$f":"VLOOKUP(H145,data[],12,FALSE)","v":{"$error":"#N/A"}}]
[null,null,null,null,null,null,141,"2017-01-01",{"$f":"Settings!$C$11-((Settings!$C$11-Settings!$E$11)/(Settings!$E$8-Settings!$C$8)*$G146)","v":103.15102739726026},{"$f":"VLOOKUP(H146,data[],2,FALSE)","v":{"$error":"#N/A"}},{"$f":"VLOOKUP(H146,data[],12,FALSE)","v":{"$error":"#N/A"}}]
[null,null,null,null,null,null,142,"2017-01-02",{"$f":"Settings!$C$11-((Settings!$C$11-Settings!$E$11)/(Settings!$E$8-Settings!$C$8)*$G147)","v":103.03082191780823},{"$f":"VLOOKUP(H147,data[],2,FALSE)","v":{"$error":"#N/A"}},{"$f":"VLOOKUP(H147,data[],12,FALSE)","v":{"$error":"#N/A"}}]
[null,null,null,null,null,null,143,"2017-01-03",{"$f":"Settings!$C$11-((Settings!$C$11-Settings!$E$11)/(Settings!$E$8-Settings!$C$8)*$G148)","v":102.91061643835616},{"$f":"VLOOKUP(H148,data[],2,FALSE)","v":{"$error":"#N/A"}},{"$f":"VLOOKUP(H148,data[],12,FALSE)","v":{"$error":"#N/A"}}]
[null,null,null,null,null,null,144,"2017-01-04",{"$f":"Settings!$C$11-((Settings!$C$11-Settings!$E$11)/(Settings!$E$8-Settings!$C$8)*$G149)","v":102.7904109589041},{"$f":"VLOOKUP(H149,data[],2,FALSE)","v":{"$error":"#N/A"}},{"$f":"VLOOKUP(H149,data[],12,FALSE)","v":{"$error":"#N/A"}}]
[null,null,null,null,null,null,145,"2017-01-05",{"$f":"Settings!$C$11-((Settings!$C$11-Settings!$E$11)/(Settings!$E$8-Settings!$C$8)*$G150)","v":102.67020547945205},{"$f":"VLOOKUP(H150,data[],2,FALSE)","v":{"$error":"#N/A"}},{"$f":"VLOOKUP(H150,data[],12,FALSE)","v":{"$error":"#N/A"}}]
[null,null,null,null,null,null,146,"2017-01-06",{"$f":"Settings!$C$11-((Settings!$C$11-Settings!$E$11)/(Settings!$E$8-Settings!$C$8)*$G151)","v":102.55},{"$f":"VLOOKUP(H151,data[],2,FALSE)","v":{"$error":"#N/A"}},{"$f":"VLOOKUP(H151,data[],12,FALSE)","v":{"$error":"#N/A"}}]
[null,null,null,null,null,null,147,"2017-01-07",{"$f":"Settings!$C$11-((Settings!$C$11-Settings!$E$11)/(Settings!$E$8-Settings!$C$8)*$G152)","v":102.42979452054794},{"$f":"VLOOKUP(H152,data[],2,FALSE)","v":{"$error":"#N/A"}},{"$f":"VLOOKUP(H152,data[],12,FALSE)","v":{"$error":"#N/A"}}]
[null,null,null,null,null,null,148,"2017-01-08",{"$f":"Settings!$C$11-((Settings!$C$11-Settings!$E$11)/(Settings!$E$8-Settings!$C$8)*$G153)","v":102.30958904109589},{"$f":"VLOOKUP(H153,data[],2,FALSE)","v":{"$error":"#N/A"}},{"$f":"VLOOKUP(H153,data[],12,FALSE)","v":{"$error":"#N/A"}}]
[null,null,null,null,null,null,149,"2017-01-09",{"$f":"Settings!$C$11-((Settings!$C$11-Settings!$E$11)/(Settings!$E$8-Settings!$C$8)*$G154)","v":102.18938356164384},{"$f":"VLOOKUP(H154,data[],2,FALSE)","v":{"$error":"#N/A"}},{"$f":"VLOOKUP(H154,data[],12,FALSE)","v":{"$error":"#N/A"}}]
[null,null,null,null,null,null,150,"2017-01-10",{"$f":"Settings!$C$11-((Settings!$C$11-Settings!$E$11)/(Settings!$E$8-Settings!$C$8)*$G155)","v":102.06917808219178},{"$f":"VLOOKUP(H155,data[],2,FALSE)","v":{"$error":"#N/A"}},{"$f":"VLOOKUP(H155,data[],12,FALSE)","v":{"$error":"#N/A"}}]
[null,null,null,null,null,null,151,"2017-01-11",{"$f":"Settings!$C$11-((Settings!$C$11-Settings!$E$11)/(Settings!$E$8-Settings!$C$8)*$G156)","v":101.94897260273973},{"$f":"VLOOKUP(H156,data[],2,FALSE)","v":{"$error":"#N/A"}},{"$f":"VLOOKUP(H156,data[],12,FALSE)","v":{"$error":"#N/A"}}]
[null,null,null,null,null,null,152,"2017-01-12",{"$f":"Settings!$C$11-((Settings!$C$11-Settings!$E$11)/(Settings!$E$8-Settings!$C$8)*$G157)","v":101.82876712328766},{"$f":"VLOOKUP(H157,data[],2,FALSE)","v":{"$error":"#N/A"}},{"$f":"VLOOKUP(H157,data[],12,FALSE)","v":{"$error":"#N/A"}}]
[null,null,null,null,null,null,153,"2017-01-13",{"$f":"Settings!$C$11-((Settings!$C$11-Settings!$E$11)/(Settings!$E$8-Settings!$C$8)*$G158)","v":101.70856164383562},{"$f":"VLOOKUP(H158,data[],2,FALSE)","v":{"$error":"#N/A"}},{"$f":"VLOOKUP(H158,data[],12,FALSE)","v":{"$error":"#N/A"}}]
[null,null,null,null,null,null,154,"2017-01-14",{"$f":"Settings!$C$11-((Settings!$C$11-Settings!$E$11)/(Settings!$E$8-Settings!$C$8)*$G159)","v":101.58835616438355},{"$f":"VLOOKUP(H159,data[],2,FALSE)","v":{"$error":"#N/A"}},{"$f":"VLOOKUP(H159,data[],12,FALSE)","v":{"$error":"#N/A"}}]
[null,null,null,null,null,null,155,"2017-01-15",{"$f":"Settings!$C$11-((Settings!$C$11-Settings!$E$11)/(Settings!$E$8-Settings!$C$8)*$G160)","v":101.4681506849315},{"$f":"VLOOKUP(H160,data[],2,FALSE)","v":{"$error":"#N/A"}},{"$f":"VLOOKUP(H160,data[],12,FALSE)","v":{"$error":"#N/A"}}]
[null,null,null,null,null,null,156,"2017-01-16",{"$f":"Settings!$C$11-((Settings!$C$11-Settings!$E$11)/(Settings!$E$8-Settings!$C$8)*$G161)","v":101.34794520547945},{"$f":"VLOOKUP(H161,data[],2,FALSE)","v":{"$error":"#N/A"}},{"$f":"VLOOKUP(H161,data[],12,FALSE)","v":{"$error":"#N/A"}}]
[null,null,null,null,null,null,157,"2017-01-17",{"$f":"Settings!$C$11-((Settings!$C$11-Settings!$E$11)/(Settings!$E$8-Settings!$C$8)*$G162)","v":101.22773972602739},{"$f":"VLOOKUP(H162,data[],2,FALSE)","v":{"$error":"#N/A"}},{"$f":"VLOOKUP(H162,data[],12,FALSE)","v":{"$error":"#N/A"}}]
[null,null,null,null,null,null,158,"2017-01-18",{"$f":"Settings!$C$11-((Settings!$C$11-Settings!$E$11)/(Settings!$E$8-Settings!$C$8)*$G163)","v":101.10753424657534},{"$f":"VLOOKUP(H163,data[],2,FALSE)","v":{"$error":"#N/A"}},{"$f":"VLOOKUP(H163,data[],12,FALSE)","v":{"$error":"#N/A"}}]
[null,null,null,null,null,null,159,"2017-01-19",{"$f":"Settings!$C$11-((Settings!$C$11-Settings!$E$11)/(Settings!$E$8-Settings!$C$8)*$G164)","v":100.98732876712329},{"$f":"VLOOKUP(H164,data[],2,FALSE)","v":{"$error":"#N/A"}},{"$f":"VLOOKUP(H164,data[],12,FALSE)","v":{"$error":"#N/A"}}]
[null,null,null,null,null,null,160,"2017-01-20",{"$f":"Settings!$C$11-((Settings!$C$11-Settings!$E$11)/(Settings!$E$8-Settings!$C$8)*$G165)","v":100.86712328767123},{"$f":"VLOOKUP(H165,data[],2,FALSE)","v":{"$error":"#N/A"}},{"$f":"VLOOKUP(H165,data[],12,FALSE)","v":{"$error":"#N/A"}}]
[null,null,null,null,null,null,161,"2017-01-21",{"$f":"Settings!$C$11-((Settings!$C$11-Settings!$E$11)/(Settings!$E$8-Settings!$C$8)*$G166)","v":100.74691780821918},{"$f":"VLOOKUP(H166,data[],2,FALSE)","v":{"$error":"#N/A"}},{"$f":"VLOOKUP(H166,data[],12,FALSE)","v":{"$error":"#N/A"}}]
[null,null,null,null,null,null,162,"2017-01-22",{"$f":"Settings!$C$11-((Settings!$C$11-Settings!$E$11)/(Settings!$E$8-Settings!$C$8)*$G167)","v":100.62671232876713},{"$f":"VLOOKUP(H167,data[],2,FALSE)","v":{"$error":"#N/A"}},{"$f":"VLOOKUP(H167,data[],12,FALSE)","v":{"$error":"#N/A"}}]
[null,null,null,null,null,null,163,"2017-01-23",{"$f":"Settings!$C$11-((Settings!$C$11-Settings!$E$11)/(Settings!$E$8-Settings!$C$8)*$G168)","v":100.50650684931506},{"$f":"VLOOKUP(H168,data[],2,FALSE)","v":{"$error":"#N/A"}},{"$f":"VLOOKUP(H168,data[],12,FALSE)","v":{"$error":"#N/A"}}]
[null,null,null,null,null,null,164,"2017-01-24",{"$f":"Settings!$C$11-((Settings!$C$11-Settings!$E$11)/(Settings!$E$8-Settings!$C$8)*$G169)","v":100.38630136986302},{"$f":"VLOOKUP(H169,data[],2,FALSE)","v":{"$error":"#N/A"}},{"$f":"VLOOKUP(H169,data[],12,FALSE)","v":{"$error":"#N/A"}}]
[null,null,null,null,null,null,165,"2017-01-25",{"$f":"Settings!$C$11-((Settings!$C$11-Settings!$E$11)/(Settings!$E$8-Settings!$C$8)*$G170)","v":100.26609589041095},{"$f":"VLOOKUP(H170,data[],2,FALSE)","v":{"$error":"#N/A"}},{"$f":"VLOOKUP(H170,data[],12,FALSE)","v":{"$error":"#N/A"}}]
[null,null,null,null,null,null,166,"2017-01-26",{"$f":"Settings!$C$11-((Settings!$C$11-Settings!$E$11)/(Settings!$E$8-Settings!$C$8)*$G171)","v":100.1458904109589},{"$f":"VLOOKUP(H171,data[],2,FALSE)","v":{"$error":"#N/A"}},{"$f":"VLOOKUP(H171,data[],12,FALSE)","v":{"$error":"#N/A"}}]
[null,null,null,null,null,null,167,"2017-01-27",{"$f":"Settings!$C$11-((Settings!$C$11-Settings!$E$11)/(Settings!$E$8-Settings!$C$8)*$G172)","v":100.02568493150685},{"$f":"VLOOKUP(H172,data[],2,FALSE)","v":{"$error":"#N/A"}},{"$f":"VLOOKUP(H172,data[],12,FALSE)","v":{"$error":"#N/A"}}]
[null,null,null,null,null,null,168,"2017-01-28",{"$f":"Settings!$C$11-((Settings!$C$11-Settings!$E$11)/(Settings!$E$8-Settings!$C$8)*$G173)","v":99.905479452054792},{"$f":"VLOOKUP(H173,data[],2,FALSE)","v":{"$error":"#N/A"}},{"$f":"VLOOKUP(H173,data[],12,FALSE)","v":{"$error":"#N/A"}}]
[null,null,null,null,null,null,169,"2017-01-29",{"$f":"Settings!$C$11-((Settings!$C$11-Settings!$E$11)/(Settings!$E$8-Settings!$C$8)*$G174)","v":99.785273972602738},{"$f":"VLOOKUP(H174,data[],2,FALSE)","v":{"$error":"#N/A"}},{"$f":"VLOOKUP(H174,data[],12,FALSE)","v":{"$error":"#N/A"}}]
[null,null,null,null,null,null,170,"2017-01-30",{"$f":"Settings!$C$11-((Settings!$C$11-Settings!$E$11)/(Settings!$E$8-Settings!$C$8)*$G175)","v":99.665068493150685},{"$f":"VLOOKUP(H175,data[],2,FALSE)","v":{"$error":"#N/A"}},{"$f":"VLOOKUP(H175,data[],12,FALSE)","v":{"$error":"#N/A"}}]
[null,null,null,null,null,null,171,"2017-01-31",{"$f":"Settings!$C$11-((Settings!$C$11-Settings!$E$11)/(Settings!$E$8-Settings!$C$8)*$G176)","v":99.544863013698631},{"$f":"VLOOKUP(H176,data[],2,FALSE)","v":{"$error":"#N/A"}},{"$f":"VLOOKUP(H176,data[],12,FALSE)","v":{"$error":"#N/A"}}]
[null,null,null,null,null,null,172,"2017-02-01",{"$f":"Settings!$C$11-((Settings!$C$11-Settings!$E$11)/(Settings!$E$8-Settings!$C$8)*$G177)","v":99.424657534246577},{"$f":"VLOOKUP(H177,data[],2,FALSE)","v":{"$error":"#N/A"}},{"$f":"VLOOKUP(H177,data[],12,FALSE)","v":{"$error":"#N/A"}}]
[null,null,null,null,null,null,173,"2017-02-02",{"$f":"Settings!$C$11-((Settings!$C$11-Settings!$E$11)/(Settings!$E$8-Settings!$C$8)*$G178)","v":99.304452054794524},{"$f":"VLOOKUP(H178,data[],2,FALSE)","v":{"$error":"#N/A"}},{"$f":"VLOOKUP(H178,data[],12,FALSE)","v":{"$error":"#N/A"}}]
[null,null,null,null,null,null,174,"2017-02-03",{"$f":"Settings!$C$11-((Settings!$C$11-Settings!$E$11)/(Settings!$E$8-Settings!$C$8)*$G179)","v":99.184246575342456},{"$f":"VLOOKUP(H179,data[],2,FALSE)","v":{"$error":"#N/A"}},{"$f":"VLOOKUP(H179,data[],12,FALSE)","v":{"$error":"#N/A"}}]
[null,null,null,null,null,null,175,"2017-02-04",{"$f":"Settings!$C$11-((Settings!$C$11-Settings!$E$11)/(Settings!$E$8-Settings!$C$8)*$G180)","v":99.064041095890417},{"$f":"VLOOKUP(H180,data[],2,FALSE)","v":{"$error":"#N/A"}},{"$f":"VLOOKUP(H180,data[],12,FALSE)","v":{"$error":"#N/A"}}]
[null,null,null,null,null,null,176,"2017-02-05",{"$f":"Settings!$C$11-((Settings!$C$11-Settings!$E$11)/(Settings!$E$8-Settings!$C$8)*$G181)","v":98.943835616438349},{"$f":"VLOOKUP(H181,data[],2,FALSE)","v":{"$error":"#N/A"}},{"$f":"VLOOKUP(H181,data[],12,FALSE)","v":{"$error":"#N/A"}}]
[null,null,null,null,null,null,177,"2017-02-06",{"$f":"Settings!$C$11-((Settings!$C$11-Settings!$E$11)/(Settings!$E$8-Settings!$C$8)*$G182)","v":98.823630136986296},{"$f":"VLOOKUP(H182,data[],2,FALSE)","v":{"$error":"#N/A"}},{"$f":"VLOOKUP(H182,data[],12,FALSE)","v":{"$error":"#N/A"}}]
[null,null,null,null,null,null,178,"2017-02-07",{"$f":"Settings!$C$11-((Settings!$C$11-Settings!$E$11)/(Settings!$E$8-Settings!$C$8)*$G183)","v":98.703424657534242},{"$f":"VLOOKUP(H183,data[],2,FALSE)","v":{"$error":"#N/A"}},{"$f":"VLOOKUP(H183,data[],12,FALSE)","v":{"$error":"#N/A"}}]
[null,null,null,null,null,null,179,"2017-02-08",{"$f":"Settings!$C$11-((Settings!$C$11-Settings!$E$11)/(Settings!$E$8-Settings!$C$8)*$G184)","v":98.583219178082189},{"$f":"VLOOKUP(H184,data[],2,FALSE)","v":115.7},{"$f":"VLOOKUP(H184,data[],12,FALSE)","v":85}]
[null,null,null,null,null,null,180,"2017-02-09",{"$f":"Settings!$C$11-((Settings!$C$11-Settings!$E$11)/(Settings!$E$8-Settings!$C$8)*$G185)","v":98.463013698630135},{"$f":"VLOOKUP(H185,data[],2,FALSE)","v":{"$error":"#N/A"}},{"$f":"VLOOKUP(H185,data[],12,FALSE)","v":{"$error":"#N/A"}}]
[null,null,null,null,null,null,181,"2017-02-10",{"$f":"Settings!$C$11-((Settings!$C$11-Settings!$E$11)/(Settings!$E$8-Settings!$C$8)*$G186)","v":98.342808219178082},{"$f":"VLOOKUP(H186,data[],2,FALSE)","v":{"$error":"#N/A"}},{"$f":"VLOOKUP(H186,data[],12,FALSE)","v":{"$error":"#N/A"}}]
[null,null,null,null,null,null,182,"2017-02-11",{"$f":"Settings!$C$11-((Settings!$C$11-Settings!$E$11)/(Settings!$E$8-Settings!$C$8)*$G187)","v":98.222602739726028},{"$f":"VLOOKUP(H187,data[],2,FALSE)","v":{"$error":"#N/A"}},{"$f":"VLOOKUP(H187,data[],12,FALSE)","v":{"$error":"#N/A"}}]
[null,null,null,null,null,null,183,"2017-02-12",{"$f":"Settings!$C$11-((Settings!$C$11-Settings!$E$11)/(Settings!$E$8-Settings!$C$8)*$G188)","v":98.102397260273975},{"$f":"VLOOKUP(H188,data[],2,FALSE)","v":{"$error":"#N/A"}},{"$f":"VLOOKUP(H188,data[],12,FALSE)","v":{"$error":"#N/A"}}]
[null,null,null,null,null,null,184,"2017-02-13",{"$f":"Settings!$C$11-((Settings!$C$11-Settings!$E$11)/(Settings!$E$8-Settings!$C$8)*$G189)","v":97.982191780821921},{"$f":"VLOOKUP(H189,data[],2,FALSE)","v":{"$error":"#N/A"}},{"$f":"VLOOKUP(H189,data[],12,FALSE)","v":{"$error":"#N/A"}}]
[null,null,null,null,null,null,185,"2017-02-14",{"$f":"Settings!$C$11-((Settings!$C$11-Settings!$E$11)/(Settings!$E$8-Settings!$C$8)*$G190)","v":97.861986301369853},{"$f":"VLOOKUP(H190,data[],2,FALSE)","v":{"$error":"#N/A"}},{"$f":"VLOOKUP(H190,data[],12,FALSE)","v":{"$error":"#N/A"}}]
[null,null,null,null,null,null,186,"2017-02-15",{"$f":"Settings!$C$11-((Settings!$C$11-Settings!$E$11)/(Settings!$E$8-Settings!$C$8)*$G191)","v":97.741780821917814},{"$f":"VLOOKUP(H191,data[],2,FALSE)","v":{"$error":"#N/A"}},{"$f":"VLOOKUP(H191,data[],12,FALSE)","v":{"$error":"#N/A"}}]
[null,null,null,null,null,null,187,"2017-02-16",{"$f":"Settings!$C$11-((Settings!$C$11-Settings!$E$11)/(Settings!$E$8-Settings!$C$8)*$G192)","v":97.621575342465746},{"$f":"VLOOKUP(H192,data[],2,FALSE)","v":{"$error":"#N/A"}},{"$f":"VLOOKUP(H192,data[],12,FALSE)","v":{"$error":"#N/A"}}]
[null,null,null,null,null,null,188,"2017-02-17",{"$f":"Settings!$C$11-((Settings!$C$11-Settings!$E$11)/(Settings!$E$8-Settings!$C$8)*$G193)","v":97.501369863013693},{"$f":"VLOOKUP(H193,data[],2,FALSE)","v":{"$error":"#N/A"}},{"$f":"VLOOKUP(H193,data[],12,FALSE)","v":{"$error":"#N/A"}}]
[null,null,null,null,null,null,189,"2017-02-18",{"$f":"Settings!$C$11-((Settings!$C$11-Settings!$E$11)/(Settings!$E$8-Settings!$C$8)*$G194)","v":97.381164383561639},{"$f":"VLOOKUP(H194,data[],2,FALSE)","v":{"$error":"#N/A"}},{"$f":"VLOOKUP(H194,data[],12,FALSE)","v":{"$error":"#N/A"}}]
[null,null,null,null,null,null,190,"2017-02-19",{"$f":"Settings!$C$11-((Settings!$C$11-Settings!$E$11)/(Settings!$E$8-Settings!$C$8)*$G195)","v":97.260958904109586},{"$f":"VLOOKUP(H195,data[],2,FALSE)","v":{"$error":"#N/A"}},{"$f":"VLOOKUP(H195,data[],12,FALSE)","v":{"$error":"#N/A"}}]
[null,null,null,null,null,null,191,"2017-02-20",{"$f":"Settings!$C$11-((Settings!$C$11-Settings!$E$11)/(Settings!$E$8-Settings!$C$8)*$G196)","v":97.140753424657532},{"$f":"VLOOKUP(H196,data[],2,FALSE)","v":{"$error":"#N/A"}},{"$f":"VLOOKUP(H196,data[],12,FALSE)","v":{"$error":"#N/A"}}]
[null,null,null,null,null,null,192,"2017-02-21",{"$f":"Settings!$C$11-((Settings!$C$11-Settings!$E$11)/(Settings!$E$8-Settings!$C$8)*$G197)","v":97.020547945205479},{"$f":"VLOOKUP(H197,data[],2,FALSE)","v":{"$error":"#N/A"}},{"$f":"VLOOKUP(H197,data[],12,FALSE)","v":{"$error":"#N/A"}}]
[null,null,null,null,null,null,{"$f":"G197+1","v":193},{"$f":"H197+1","v":"2017-02-22"},{"$f":"Settings!$C$11-((Settings!$C$11-Settings!$E$11)/(Settings!$E$8-Settings!$C$8)*$G198)","v":96.900342465753425},{"$f":"VLOOKUP(H198,data[],2,FALSE)","v":{"$error":"#N/A"}},{"$f":"VLOOKUP(H198,data[],12,FALSE)","v":{"$error":"#N/A"}}]
[null,null,null,null,null,null,194,"2017-02-23",{"$f":"Settings!$C$11-((Settings!$C$11-Settings!$E$11)/(Settings!$E$8-Settings!$C$8)*$G199)","v":96.780136986301372},{"$f":"VLOOKUP(H199,data[],2,FALSE)","v":{"$error":"#N/A"}},{"$f":"VLOOKUP(H199,data[],12,FALSE)","v":{"$error":"#N/A"}}]
[null,null,null,null,null,null,195,"2017-02-24",{"$f":"Settings!$C$11-((Settings!$C$11-Settings!$E$11)/(Settings!$E$8-Settings!$C$8)*$G200)","v":96.659931506849318},{"$f":"VLOOKUP(H200,data[],2,FALSE)","v":{"$error":"#N/A"}},{"$f":"VLOOKUP(H200,data[],12,FALSE)","v":{"$error":"#N/A"}}]
[null,null,null,null,null,null,196,"2017-02-25",{"$f":"Settings!$C$11-((Settings!$C$11-Settings!$E$11)/(Settings!$E$8-Settings!$C$8)*$G201)","v":96.539726027397251},{"$f":"VLOOKUP(H201,data[],2,FALSE)","v":{"$error":"#N/A"}},{"$f":"VLOOKUP(H201,data[],12,FALSE)","v":{"$error":"#N/A"}}]
[null,null,null,null,null,null,197,"2017-02-26",{"$f":"Settings!$C$11-((Settings!$C$11-Settings!$E$11)/(Settings!$E$8-Settings!$C$8)*$G202)","v":96.419520547945211},{"$f":"VLOOKUP(H202,data[],2,FALSE)","v":{"$error":"#N/A"}},{"$f":"VLOOKUP(H202,data[],12,FALSE)","v":{"$error":"#N/A"}}]
[null,null,null,null,null,null,198,"2017-02-27",{"$f":"Settings!$C$11-((Settings!$C$11-Settings!$E$11)/(Settings!$E$8-Settings!$C$8)*$G203)","v":96.299315068493144},{"$f":"VLOOKUP(H203,data[],2,FALSE)","v":{"$error":"#N/A"}},{"$f":"VLOOKUP(H203,data[],12,FALSE)","v":{"$error":"#N/A"}}]
[null,null,null,null,null,null,199,"2017-02-28",{"$f":"Settings!$C$11-((Settings!$C$11-Settings!$E$11)/(Settings!$E$8-Settings!$C$8)*$G204)","v":96.17910958904109},{"$f":"VLOOKUP(H204,data[],2,FALSE)","v":{"$error":"#N/A"}},{"$f":"VLOOKUP(H204,data[],12,FALSE)","v":{"$error":"#N/A"}}]
[null,null,null,null,null,null,200,"2017-03-01",{"$f":"Settings!$C$11-((Settings!$C$11-Settings!$E$11)/(Settings!$E$8-Settings!$C$8)*$G205)","v":96.058904109589037},{"$f":"VLOOKUP(H205,data[],2,FALSE)","v":{"$error":"#N/A"}},{"$f":"VLOOKUP(H205,data[],12,FALSE)","v":{"$error":"#N/A"}}]
[null,null,null,null,null,null,201,"2017-03-02",{"$f":"Settings!$C$11-((Settings!$C$11-Settings!$E$11)/(Settings!$E$8-Settings!$C$8)*$G206)","v":95.938698630136983},{"$f":"VLOOKUP(H206,data[],2,FALSE)","v":{"$error":"#N/A"}},{"$f":"VLOOKUP(H206,data[],12,FALSE)","v":{"$error":"#N/A"}}]
[null,null,null,null,null,null,202,"2017-03-03",{"$f":"Settings!$C$11-((Settings!$C$11-Settings!$E$11)/(Settings!$E$8-Settings!$C$8)*$G207)","v":95.81849315068493},{"$f":"VLOOKUP(H207,data[],2,FALSE)","v":{"$error":"#N/A"}},{"$f":"VLOOKUP(H207,data[],12,FALSE)","v":{"$error":"#N/A"}}]
[null,null,null,null,null,null,203,"2017-03-04",{"$f":"Settings!$C$11-((Settings!$C$11-Settings!$E$11)/(Settings!$E$8-Settings!$C$8)*$G208)","v":95.698287671232876},{"$f":"VLOOKUP(H208,data[],2,FALSE)","v":{"$error":"#N/A"}},{"$f":"VLOOKUP(H208,data[],12,FALSE)","v":{"$error":"#N/A"}}]
[null,null,null,null,null,null,204,"2017-03-05",{"$f":"Settings!$C$11-((Settings!$C$11-Settings!$E$11)/(Settings!$E$8-Settings!$C$8)*$G209)","v":95.578082191780823},{"$f":"VLOOKUP(H209,data[],2,FALSE)","v":{"$error":"#N/A"}},{"$f":"VLOOKUP(H209,data[],12,FALSE)","v":{"$error":"#N/A"}}]
[null,null,null,null,null,null,205,"2017-03-06",{"$f":"Settings!$C$11-((Settings!$C$11-Settings!$E$11)/(Settings!$E$8-Settings!$C$8)*$G210)","v":95.457876712328769},{"$f":"VLOOKUP(H210,data[],2,FALSE)","v":{"$error":"#N/A"}},{"$f":"VLOOKUP(H210,data[],12,FALSE)","v":{"$error":"#N/A"}}]
[null,null,null,null,null,null,206,"2017-03-07",{"$f":"Settings!$C$11-((Settings!$C$11-Settings!$E$11)/(Settings!$E$8-Settings!$C$8)*$G211)","v":95.337671232876716},{"$f":"VLOOKUP(H211,data[],2,FALSE)","v":{"$error":"#N/A"}},{"$f":"VLOOKUP(H211,data[],12,FALSE)","v":{"$error":"#N/A"}}]
[null,null,null,null,null,null,207,"2017-03-08",{"$f":"Settings!$C$11-((Settings!$C$11-Settings!$E$11)/(Settings!$E$8-Settings!$C$8)*$G212)","v":95.217465753424648},{"$f":"VLOOKUP(H212,data[],2,FALSE)","v":{"$error":"#N/A"}},{"$f":"VLOOKUP(H212,data[],12,FALSE)","v":{"$error":"#N/A"}}]
[null,null,null,null,null,null,208,"2017-03-09",{"$f":"Settings!$C$11-((Settings!$C$11-Settings!$E$11)/(Settings!$E$8-Settings!$C$8)*$G213)","v":95.097260273972609},{"$f":"VLOOKUP(H213,data[],2,FALSE)","v":{"$error":"#N/A"}},{"$f":"VLOOKUP(H213,data[],12,FALSE)","v":{"$error":"#N/A"}}]
[null,null,null,null,null,null,209,"2017-03-10",{"$f":"Settings!$C$11-((Settings!$C$11-Settings!$E$11)/(Settings!$E$8-Settings!$C$8)*$G214)","v":94.977054794520541},{"$f":"VLOOKUP(H214,data[],2,FALSE)","v":{"$error":"#N/A"}},{"$f":"VLOOKUP(H214,data[],12,FALSE)","v":{"$error":"#N/A"}}]
[null,null,null,null,null,null,210,"2017-03-11",{"$f":"Settings!$C$11-((Settings!$C$11-Settings!$E$11)/(Settings!$E$8-Settings!$C$8)*$G215)","v":94.856849315068487},{"$f":"VLOOKUP(H215,data[],2,FALSE)","v":{"$error":"#N/A"}},{"$f":"VLOOKUP(H215,data[],12,FALSE)","v":{"$error":"#N/A"}}]
[null,null,null,null,null,null,211,"2017-03-12",{"$f":"Settings!$C$11-((Settings!$C$11-Settings!$E$11)/(Settings!$E$8-Settings!$C$8)*$G216)","v":94.736643835616434},{"$f":"VLOOKUP(H216,data[],2,FALSE)","v":{"$error":"#N/A"}},{"$f":"VLOOKUP(H216,data[],12,FALSE)","v":{"$error":"#N/A"}}]
[null,null,null,null,null,null,212,"2017-03-13",{"$f":"Settings!$C$11-((Settings!$C$11-Settings!$E$11)/(Settings!$E$8-Settings!$C$8)*$G217)","v":94.61643835616438},{"$f":"VLOOKUP(H217,data[],2,FALSE)","v":{"$error":"#N/A"}},{"$f":"VLOOKUP(H217,data[],12,FALSE)","v":{"$error":"#N/A"}}]
[null,null,null,null,null,null,213,"2017-03-14",{"$f":"Settings!$C$11-((Settings!$C$11-Settings!$E$11)/(Settings!$E$8-Settings!$C$8)*$G218)","v":94.496232876712327},{"$f":"VLOOKUP(H218,data[],2,FALSE)","v":{"$error":"#N/A"}},{"$f":"VLOOKUP(H218,data[],12,FALSE)","v":{"$error":"#N/A"}}]
[null,null,null,null,null,null,214,"2017-03-15",{"$f":"Settings!$C$11-((Settings!$C$11-Settings!$E$11)/(Settings!$E$8-Settings!$C$8)*$G219)","v":94.376027397260273},{"$f":"VLOOKUP(H219,data[],2,FALSE)","v":{"$error":"#N/A"}},{"$f":"VLOOKUP(H219,data[],12,FALSE)","v":{"$error":"#N/A"}}]
[null,null,null,null,null,null,215,"2017-03-16",{"$f":"Settings!$C$11-((Settings!$C$11-Settings!$E$11)/(Settings!$E$8-Settings!$C$8)*$G220)","v":94.25582191780822},{"$f":"VLOOKUP(H220,data[],2,FALSE)","v":{"$error":"#N/A"}},{"$f":"VLOOKUP(H220,data[],12,FALSE)","v":{"$error":"#N/A"}}]
[null,null,null,null,null,null,216,"2017-03-17",{"$f":"Settings!$C$11-((Settings!$C$11-Settings!$E$11)/(Settings!$E$8-Settings!$C$8)*$G221)","v":94.135616438356166},{"$f":"VLOOKUP(H221,data[],2,FALSE)","v":{"$error":"#N/A"}},{"$f":"VLOOKUP(H221,data[],12,FALSE)","v":{"$error":"#N/A"}}]
[null,null,null,null,null,null,217,"2017-03-18",{"$f":"Settings!$C$11-((Settings!$C$11-Settings!$E$11)/(Settings!$E$8-Settings!$C$8)*$G222)","v":94.015410958904113},{"$f":"VLOOKUP(H222,data[],2,FALSE)","v":{"$error":"#N/A"}},{"$f":"VLOOKUP(H222,data[],12,FALSE)","v":{"$error":"#N/A"}}]
[null,null,null,null,null,null,218,"2017-03-19",{"$f":"Settings!$C$11-((Settings!$C$11-Settings!$E$11)/(Settings!$E$8-Settings!$C$8)*$G223)","v":93.895205479452059},{"$f":"VLOOKUP(H223,data[],2,FALSE)","v":{"$error":"#N/A"}},{"$f":"VLOOKUP(H223,data[],12,FALSE)","v":{"$error":"#N/A"}}]
[null,null,null,null,null,null,219,"2017-03-20",{"$f":"Settings!$C$11-((Settings!$C$11-Settings!$E$11)/(Settings!$E$8-Settings!$C$8)*$G224)","v":93.775000000000006},{"$f":"VLOOKUP(H224,data[],2,FALSE)","v":{"$error":"#N/A"}},{"$f":"VLOOKUP(H224,data[],12,FALSE)","v":{"$error":"#N/A"}}]
[null,null,null,null,null,null,220,"2017-03-21",{"$f":"Settings!$C$11-((Settings!$C$11-Settings!$E$11)/(Settings!$E$8-Settings!$C$8)*$G225)","v":93.654794520547938},{"$f":"VLOOKUP(H225,data[],2,FALSE)","v":{"$error":"#N/A"}},{"$f":"VLOOKUP(H225,data[],12,FALSE)","v":{"$error":"#N/A"}}]
[null,null,null,null,null,null,221,"2017-03-22",{"$f":"Settings!$C$11-((Settings!$C$11-Settings!$E$11)/(Settings!$E$8-Settings!$C$8)*$G226)","v":93.534589041095884},{"$f":"VLOOKUP(H226,data[],2,FALSE)","v":{"$error":"#N/A"}},{"$f":"VLOOKUP(H226,data[],12,FALSE)","v":{"$error":"#N/A"}}]
[null,null,null,null,null,null,222,"2017-03-23",{"$f":"Settings!$C$11-((Settings!$C$11-Settings!$E$11)/(Settings!$E$8-Settings!$C$8)*$G227)","v":93.414383561643831},{"$f":"VLOOKUP(H227,data[],2,FALSE)","v":{"$error":"#N/A"}},{"$f":"VLOOKUP(H227,data[],12,FALSE)","v":{"$error":"#N/A"}}]
[null,null,null,null,null,null,223,"2017-03-24",{"$f":"Settings!$C$11-((Settings!$C$11-Settings!$E$11)/(Settings!$E$8-Settings!$C$8)*$G228)","v":93.294178082191777},{"$f":"VLOOKUP(H228,data[],2,FALSE)","v":{"$error":"#N/A"}},{"$f":"VLOOKUP(H228,data[],12,FALSE)","v":{"$error":"#N/A"}}]
[null,null,null,null,null,null,224,"2017-03-25",{"$f":"Settings!$C$11-((Settings!$C$11-Settings!$E$11)/(Settings!$E$8-Settings!$C$8)*$G229)","v":93.173972602739724},{"$f":"VLOOKUP(H229,data[],2,FALSE)","v":{"$error":"#N/A"}},{"$f":"VLOOKUP(H229,data[],12,FALSE)","v":{"$error":"#N/A"}}]
[null,null,null,null,null,null,225,"2017-03-26",{"$f":"Settings!$C$11-((Settings!$C$11-Settings!$E$11)/(Settings!$E$8-Settings!$C$8)*$G230)","v":93.05376712328767},{"$f":"VLOOKUP(H230,data[],2,FALSE)","v":{"$error":"#N/A"}},{"$f":"VLOOKUP(H230,data[],12,FALSE)","v":{"$error":"#N/A"}}]
[null,null,null,null,null,null,226,"2017-03-27",{"$f":"Settings!$C$11-((Settings!$C$11-Settings!$E$11)/(Settings!$E$8-Settings!$C$8)*$G231)","v":92.933561643835617},{"$f":"VLOOKUP(H231,data[],2,FALSE)","v":{"$error":"#N/A"}},{"$f":"VLOOKUP(H231,data[],12,FALSE)","v":{"$error":"#N/A"}}]
[null,null,null,null,null,null,227,"2017-03-28",{"$f":"Settings!$C$11-((Settings!$C$11-Settings!$E$11)/(Settings!$E$8-Settings!$C$8)*$G232)","v":92.813356164383563},{"$f":"VLOOKUP(H232,data[],2,FALSE)","v":{"$error":"#N/A"}},{"$f":"VLOOKUP(H232,data[],12,FALSE)","v":{"$error":"#N/A"}}]
[null,null,null,null,null,null,228,"2017-03-29",{"$f":"Settings!$C$11-((Settings!$C$11-Settings!$E$11)/(Settings!$E$8-Settings!$C$8)*$G233)","v":92.69315068493151},{"$f":"VLOOKUP(H233,data[],2,FALSE)","v":{"$error":"#N/A"}},{"$f":"VLOOKUP(H233,data[],12,FALSE)","v":{"$error":"#N/A"}}]
[null,null,null,null,null,null,229,"2017-03-30",{"$f":"Settings!$C$11-((Settings!$C$11-Settings!$E$11)/(Settings!$E$8-Settings!$C$8)*$G234)","v":92.572945205479456},{"$f":"VLOOKUP(H234,data[],2,FALSE)","v":{"$error":"#N/A"}},{"$f":"VLOOKUP(H234,data[],12,FALSE)","v":{"$error":"#N/A"}}]
[null,null,null,null,null,null,230,"2017-03-31",{"$f":"Settings!$C$11-((Settings!$C$11-Settings!$E$11)/(Settings!$E$8-Settings!$C$8)*$G235)","v":92.452739726027403},{"$f":"VLOOKUP(H235,data[],2,FALSE)","v":{"$error":"#N/A"}},{"$f":"VLOOKUP(H235,data[],12,FALSE)","v":{"$error":"#N/A"}}]
[null,null,null,null,null,null,231,"2017-04-01",{"$f":"Settings!$C$11-((Settings!$C$11-Settings!$E$11)/(Settings!$E$8-Settings!$C$8)*$G236)","v":92.332534246575335},{"$f":"VLOOKUP(H236,data[],2,FALSE)","v":{"$error":"#N/A"}},{"$f":"VLOOKUP(H236,data[],12,FALSE)","v":{"$error":"#N/A"}}]
[null,null,null,null,null,null,232,"2017-04-02",{"$f":"Settings!$C$11-((Settings!$C$11-Settings!$E$11)/(Settings!$E$8-Settings!$C$8)*$G237)","v":92.212328767123296},{"$f":"VLOOKUP(H237,data[],2,FALSE)","v":{"$error":"#N/A"}},{"$f":"VLOOKUP(H237,data[],12,FALSE)","v":{"$error":"#N/A"}}]
[null,null,null,null,null,null,233,"2017-04-03",{"$f":"Settings!$C$11-((Settings!$C$11-Settings!$E$11)/(Settings!$E$8-Settings!$C$8)*$G238)","v":92.092123287671228},{"$f":"VLOOKUP(H238,data[],2,FALSE)","v":{"$error":"#N/A"}},{"$f":"VLOOKUP(H238,data[],12,FALSE)","v":{"$error":"#N/A"}}]
[null,null,null,null,null,null,234,"2017-04-04",{"$f":"Settings!$C$11-((Settings!$C$11-Settings!$E$11)/(Settings!$E$8-Settings!$C$8)*$G239)","v":91.971917808219175},{"$f":"VLOOKUP(H239,data[],2,FALSE)","v":{"$error":"#N/A"}},{"$f":"VLOOKUP(H239,data[],12,FALSE)","v":{"$error":"#N/A"}}]
[null,null,null,null,null,null,235,"2017-04-05",{"$f":"Settings!$C$11-((Settings!$C$11-Settings!$E$11)/(Settings!$E$8-Settings!$C$8)*$G240)","v":91.851712328767121},{"$f":"VLOOKUP(H240,data[],2,FALSE)","v":{"$error":"#N/A"}},{"$f":"VLOOKUP(H240,data[],12,FALSE)","v":{"$error":"#N/A"}}]
[null,null,null,null,null,null,236,"2017-04-06",{"$f":"Settings!$C$11-((Settings!$C$11-Settings!$E$11)/(Settings!$E$8-Settings!$C$8)*$G241)","v":91.731506849315068},{"$f":"VLOOKUP(H241,data[],2,FALSE)","v":{"$error":"#N/A"}},{"$f":"VLOOKUP(H241,data[],12,FALSE)","v":{"$error":"#N/A"}}]
[null,null,null,null,null,null,237,"2017-04-07",{"$f":"Settings!$C$11-((Settings!$C$11-Settings!$E$11)/(Settings!$E$8-Settings!$C$8)*$G242)","v":91.611301369863014},{"$f":"VLOOKUP(H242,data[],2,FALSE)","v":{"$error":"#N/A"}},{"$f":"VLOOKUP(H242,data[],12,FALSE)","v":{"$error":"#N/A"}}]
[null,null,null,null,null,null,238,"2017-04-08",{"$f":"Settings!$C$11-((Settings!$C$11-Settings!$E$11)/(Settings!$E$8-Settings!$C$8)*$G243)","v":91.491095890410961},{"$f":"VLOOKUP(H243,data[],2,FALSE)","v":{"$error":"#N/A"}},{"$f":"VLOOKUP(H243,data[],12,FALSE)","v":{"$error":"#N/A"}}]
[null,null,null,null,null,null,239,"2017-04-09",{"$f":"Settings!$C$11-((Settings!$C$11-Settings!$E$11)/(Settings!$E$8-Settings!$C$8)*$G244)","v":91.370890410958907},{"$f":"VLOOKUP(H244,data[],2,FALSE)","v":{"$error":"#N/A"}},{"$f":"VLOOKUP(H244,data[],12,FALSE)","v":{"$error":"#N/A"}}]
[null,null,null,null,null,null,240,"2017-04-10",{"$f":"Settings!$C$11-((Settings!$C$11-Settings!$E$11)/(Settings!$E$8-Settings!$C$8)*$G245)","v":91.250684931506854},{"$f":"VLOOKUP(H245,data[],2,FALSE)","v":{"$error":"#N/A"}},{"$f":"VLOOKUP(H245,data[],12,FALSE)","v":{"$error":"#N/A"}}]
[null,null,null,null,null,null,241,"2017-04-11",{"$f":"Settings!$C$11-((Settings!$C$11-Settings!$E$11)/(Settings!$E$8-Settings!$C$8)*$G246)","v":91.1304794520548},{"$f":"VLOOKUP(H246,data[],2,FALSE)","v":{"$error":"#N/A"}},{"$f":"VLOOKUP(H246,data[],12,FALSE)","v":{"$error":"#N/A"}}]
[null,null,null,null,null,null,242,"2017-04-12",{"$f":"Settings!$C$11-((Settings!$C$11-Settings!$E$11)/(Settings!$E$8-Settings!$C$8)*$G247)","v":91.010273972602732},{"$f":"VLOOKUP(H247,data[],2,FALSE)","v":{"$error":"#N/A"}},{"$f":"VLOOKUP(H247,data[],12,FALSE)","v":{"$error":"#N/A"}}]
[null,null,null,null,null,null,243,"2017-04-13",{"$f":"Settings!$C$11-((Settings!$C$11-Settings!$E$11)/(Settings!$E$8-Settings!$C$8)*$G248)","v":90.890068493150693},{"$f":"VLOOKUP(H248,data[],2,FALSE)","v":{"$error":"#N/A"}},{"$f":"VLOOKUP(H248,data[],12,FALSE)","v":{"$error":"#N/A"}}]
[null,null,null,null,null,null,244,"2017-04-14",{"$f":"Settings!$C$11-((Settings!$C$11-Settings!$E$11)/(Settings!$E$8-Settings!$C$8)*$G249)","v":90.769863013698625},{"$f":"VLOOKUP(H249,data[],2,FALSE)","v":{"$error":"#N/A"}},{"$f":"VLOOKUP(H249,data[],12,FALSE)","v":{"$error":"#N/A"}}]
[null,null,null,null,null,null,245,"2017-04-15",{"$f":"Settings!$C$11-((Settings!$C$11-Settings!$E$11)/(Settings!$E$8-Settings!$C$8)*$G250)","v":90.649657534246572},{"$f":"VLOOKUP(H250,data[],2,FALSE)","v":{"$error":"#N/A"}},{"$f":"VLOOKUP(H250,data[],12,FALSE)","v":{"$error":"#N/A"}}]
[null,null,null,null,null,null,246,"2017-04-16",{"$f":"Settings!$C$11-((Settings!$C$11-Settings!$E$11)/(Settings!$E$8-Settings!$C$8)*$G251)","v":90.529452054794518},{"$f":"VLOOKUP(H251,data[],2,FALSE)","v":{"$error":"#N/A"}},{"$f":"VLOOKUP(H251,data[],12,FALSE)","v":{"$error":"#N/A"}}]
[null,null,null,null,null,null,247,"2017-04-17",{"$f":"Settings!$C$11-((Settings!$C$11-Settings!$E$11)/(Settings!$E$8-Settings!$C$8)*$G252)","v":90.409246575342465},{"$f":"VLOOKUP(H252,data[],2,FALSE)","v":{"$error":"#N/A"}},{"$f":"VLOOKUP(H252,data[],12,FALSE)","v":{"$error":"#N/A"}}]
[null,null,null,null,null,null,248,"2017-04-18",{"$f":"Settings!$C$11-((Settings!$C$11-Settings!$E$11)/(Settings!$E$8-Settings!$C$8)*$G253)","v":90.289041095890411},{"$f":"VLOOKUP(H253,data[],2,FALSE)","v":{"$error":"#N/A"}},{"$f":"VLOOKUP(H253,data[],12,FALSE)","v":{"$error":"#N/A"}}]
[null,null,null,null,null,null,249,"2017-04-19",{"$f":"Settings!$C$11-((Settings!$C$11-Settings!$E$11)/(Settings!$E$8-Settings!$C$8)*$G254)","v":90.168835616438358},{"$f":"VLOOKUP(H254,data[],2,FALSE)","v":{"$error":"#N/A"}},{"$f":"VLOOKUP(H254,data[],12,FALSE)","v":{"$error":"#N/A"}}]
[null,null,null,null,null,null,250,"2017-04-20",{"$f":"Settings!$C$11-((Settings!$C$11-Settings!$E$11)/(Settings!$E$8-Settings!$C$8)*$G255)","v":90.048630136986304},{"$f":"VLOOKUP(H255,data[],2,FALSE)","v":{"$error":"#N/A"}},{"$f":"VLOOKUP(H255,data[],12,FALSE)","v":{"$error":"#N/A"}}]
[null,null,null,null,null,null,251,"2017-04-21",{"$f":"Settings!$C$11-((Settings!$C$11-Settings!$E$11)/(Settings!$E$8-Settings!$C$8)*$G256)","v":89.928424657534251},{"$f":"VLOOKUP(H256,data[],2,FALSE)","v":{"$error":"#N/A"}},{"$f":"VLOOKUP(H256,data[],12,FALSE)","v":{"$error":"#N/A"}}]
[null,null,null,null,null,null,252,"2017-04-22",{"$f":"Settings!$C$11-((Settings!$C$11-Settings!$E$11)/(Settings!$E$8-Settings!$C$8)*$G257)","v":89.808219178082197},{"$f":"VLOOKUP(H257,data[],2,FALSE)","v":{"$error":"#N/A"}},{"$f":"VLOOKUP(H257,data[],12,FALSE)","v":{"$error":"#N/A"}}]
[null,null,null,null,null,null,253,"2017-04-23",{"$f":"Settings!$C$11-((Settings!$C$11-Settings!$E$11)/(Settings!$E$8-Settings!$C$8)*$G258)","v":89.68801369863013},{"$f":"VLOOKUP(H258,data[],2,FALSE)","v":{"$error":"#N/A"}},{"$f":"VLOOKUP(H258,data[],12,FALSE)","v":{"$error":"#N/A"}}]
[null,null,null,null,null,null,254,"2017-04-24",{"$f":"Settings!$C$11-((Settings!$C$11-Settings!$E$11)/(Settings!$E$8-Settings!$C$8)*$G259)","v":89.56780821917809},{"$f":"VLOOKUP(H259,data[],2,FALSE)","v":{"$error":"#N/A"}},{"$f":"VLOOKUP(H259,data[],12,FALSE)","v":{"$error":"#N/A"}}]
[null,null,null,null,null,null,255,"2017-04-25",{"$f":"Settings!$C$11-((Settings!$C$11-Settings!$E$11)/(Settings!$E$8-Settings!$C$8)*$G260)","v":89.447602739726022},{"$f":"VLOOKUP(H260,data[],2,FALSE)","v":{"$error":"#N/A"}},{"$f":"VLOOKUP(H260,data[],12,FALSE)","v":{"$error":"#N/A"}}]
[null,null,null,null,null,null,256,"2017-04-26",{"$f":"Settings!$C$11-((Settings!$C$11-Settings!$E$11)/(Settings!$E$8-Settings!$C$8)*$G261)","v":89.327397260273969},{"$f":"VLOOKUP(H261,data[],2,FALSE)","v":{"$error":"#N/A"}},{"$f":"VLOOKUP(H261,data[],12,FALSE)","v":{"$error":"#N/A"}}]
[null,null,null,null,null,null,{"$f":"G261+1","v":257},{"$f":"H261+1","v":"2017-04-27"},{"$f":"Settings!$C$11-((Settings!$C$11-Settings!$E$11)/(Settings!$E$8-Settings!$C$8)*$G262)","v":89.207191780821915},{"$f":"VLOOKUP(H262,data[],2,FALSE)","v":{"$error":"#N/A"}},{"$f":"VLOOKUP(H262,data[],12,FALSE)","v":{"$error":"#N/A"}}]
[null,null,null,null,null,null,258,"2017-04-28",{"$f":"Settings!$C$11-((Settings!$C$11-Settings!$E$11)/(Settings!$E$8-Settings!$C$8)*$G263)","v":89.086986301369862},{"$f":"VLOOKUP(H263,data[],2,FALSE)","v":{"$error":"#N/A"}},{"$f":"VLOOKUP(H263,data[],12,FALSE)","v":{"$error":"#N/A"}}]
[null,null,null,null,null,null,259,"2017-04-29",{"$f":"Settings!$C$11-((Settings!$C$11-Settings!$E$11)/(Settings!$E$8-Settings!$C$8)*$G264)","v":88.966780821917808},{"$f":"VLOOKUP(H264,data[],2,FALSE)","v":{"$error":"#N/A"}},{"$f":"VLOOKUP(H264,data[],12,FALSE)","v":{"$error":"#N/A"}}]
[null,null,null,null,null,null,260,"2017-04-30",{"$f":"Settings!$C$11-((Settings!$C$11-Settings!$E$11)/(Settings!$E$8-Settings!$C$8)*$G265)","v":88.846575342465755},{"$f":"VLOOKUP(H265,data[],2,FALSE)","v":{"$error":"#N/A"}},{"$f":"VLOOKUP(H265,data[],12,FALSE)","v":{"$error":"#N/A"}}]
[null,null,null,null,null,null,261,"2017-05-01",{"$f":"Settings!$C$11-((Settings!$C$11-Settings!$E$11)/(Settings!$E$8-Settings!$C$8)*$G266)","v":88.726369863013701},{"$f":"VLOOKUP(H266,data[],2,FALSE)","v":{"$error":"#N/A"}},{"$f":"VLOOKUP(H266,data[],12,FALSE)","v":{"$error":"#N/A"}}]
[null,null,null,null,null,null,262,"2017-05-02",{"$f":"Settings!$C$11-((Settings!$C$11-Settings!$E$11)/(Settings!$E$8-Settings!$C$8)*$G267)","v":88.606164383561648},{"$f":"VLOOKUP(H267,data[],2,FALSE)","v":{"$error":"#N/A"}},{"$f":"VLOOKUP(H267,data[],12,FALSE)","v":{"$error":"#N/A"}}]
[null,null,null,null,null,null,263,"2017-05-03",{"$f":"Settings!$C$11-((Settings!$C$11-Settings!$E$11)/(Settings!$E$8-Settings!$C$8)*$G268)","v":88.485958904109594},{"$f":"VLOOKUP(H268,data[],2,FALSE)","v":{"$error":"#N/A"}},{"$f":"VLOOKUP(H268,data[],12,FALSE)","v":{"$error":"#N/A"}}]
[null,null,null,null,null,null,264,"2017-05-04",{"$f":"Settings!$C$11-((Settings!$C$11-Settings!$E$11)/(Settings!$E$8-Settings!$C$8)*$G269)","v":88.365753424657527},{"$f":"VLOOKUP(H269,data[],2,FALSE)","v":{"$error":"#N/A"}},{"$f":"VLOOKUP(H269,data[],12,FALSE)","v":{"$error":"#N/A"}}]
[null,null,null,null,null,null,265,"2017-05-05",{"$f":"Settings!$C$11-((Settings!$C$11-Settings!$E$11)/(Settings!$E$8-Settings!$C$8)*$G270)","v":88.245547945205487},{"$f":"VLOOKUP(H270,data[],2,FALSE)","v":{"$error":"#N/A"}},{"$f":"VLOOKUP(H270,data[],12,FALSE)","v":{"$error":"#N/A"}}]
[null,null,null,null,null,null,266,"2017-05-06",{"$f":"Settings!$C$11-((Settings!$C$11-Settings!$E$11)/(Settings!$E$8-Settings!$C$8)*$G271)","v":88.12534246575342},{"$f":"VLOOKUP(H271,data[],2,FALSE)","v":{"$error":"#N/A"}},{"$f":"VLOOKUP(H271,data[],12,FALSE)","v":{"$error":"#N/A"}}]
[null,null,null,null,null,null,267,"2017-05-07",{"$f":"Settings!$C$11-((Settings!$C$11-Settings!$E$11)/(Settings!$E$8-Settings!$C$8)*$G272)","v":88.00513698630138},{"$f":"VLOOKUP(H272,data[],2,FALSE)","v":{"$error":"#N/A"}},{"$f":"VLOOKUP(H272,data[],12,FALSE)","v":{"$error":"#N/A"}}]
[null,null,null,null,null,null,268,"2017-05-08",{"$f":"Settings!$C$11-((Settings!$C$11-Settings!$E$11)/(Settings!$E$8-Settings!$C$8)*$G273)","v":87.884931506849313},{"$f":"VLOOKUP(H273,data[],2,FALSE)","v":{"$error":"#N/A"}},{"$f":"VLOOKUP(H273,data[],12,FALSE)","v":{"$error":"#N/A"}}]
[null,null,null,null,null,null,269,"2017-05-09",{"$f":"Settings!$C$11-((Settings!$C$11-Settings!$E$11)/(Settings!$E$8-Settings!$C$8)*$G274)","v":87.764726027397259},{"$f":"VLOOKUP(H274,data[],2,FALSE)","v":{"$error":"#N/A"}},{"$f":"VLOOKUP(H274,data[],12,FALSE)","v":{"$error":"#N/A"}}]
[null,null,null,null,null,null,270,"2017-05-10",{"$f":"Settings!$C$11-((Settings!$C$11-Settings!$E$11)/(Settings!$E$8-Settings!$C$8)*$G275)","v":87.644520547945206},{"$f":"VLOOKUP(H275,data[],2,FALSE)","v":{"$error":"#N/A"}},{"$f":"VLOOKUP(H275,data[],12,FALSE)","v":{"$error":"#N/A"}}]
[null,null,null,null,null,null,271,"2017-05-11",{"$f":"Settings!$C$11-((Settings!$C$11-Settings!$E$11)/(Settings!$E$8-Settings!$C$8)*$G276)","v":87.524315068493152},{"$f":"VLOOKUP(H276,data[],2,FALSE)","v":{"$error":"#N/A"}},{"$f":"VLOOKUP(H276,data[],12,FALSE)","v":{"$error":"#N/A"}}]
[null,null,null,null,null,null,272,"2017-05-12",{"$f":"Settings!$C$11-((Settings!$C$11-Settings!$E$11)/(Settings!$E$8-Settings!$C$8)*$G277)","v":87.404109589041099},{"$f":"VLOOKUP(H277,data[],2,FALSE)","v":{"$error":"#N/A"}},{"$f":"VLOOKUP(H277,data[],12,FALSE)","v":{"$error":"#N/A"}}]
[null,null,null,null,null,null,273,"2017-05-13",{"$f":"Settings!$C$11-((Settings!$C$11-Settings!$E$11)/(Settings!$E$8-Settings!$C$8)*$G278)","v":87.283904109589031},{"$f":"VLOOKUP(H278,data[],2,FALSE)","v":{"$error":"#N/A"}},{"$f":"VLOOKUP(H278,data[],12,FALSE)","v":{"$error":"#N/A"}}]
[null,null,null,null,null,null,274,"2017-05-14",{"$f":"Settings!$C$11-((Settings!$C$11-Settings!$E$11)/(Settings!$E$8-Settings!$C$8)*$G279)","v":87.163698630136992},{"$f":"VLOOKUP(H279,data[],2,FALSE)","v":{"$error":"#N/A"}},{"$f":"VLOOKUP(H279,data[],12,FALSE)","v":{"$error":"#N/A"}}]
[null,null,null,null,null,null,275,"2017-05-15",{"$f":"Settings!$C$11-((Settings!$C$11-Settings!$E$11)/(Settings!$E$8-Settings!$C$8)*$G280)","v":87.043493150684924},{"$f":"VLOOKUP(H280,data[],2,FALSE)","v":{"$error":"#N/A"}},{"$f":"VLOOKUP(H280,data[],12,FALSE)","v":{"$error":"#N/A"}}]
[null,null,null,null,null,null,276,"2017-05-16",{"$f":"Settings!$C$11-((Settings!$C$11-Settings!$E$11)/(Settings!$E$8-Settings!$C$8)*$G281)","v":86.923287671232885},{"$f":"VLOOKUP(H281,data[],2,FALSE)","v":{"$error":"#N/A"}},{"$f":"VLOOKUP(H281,data[],12,FALSE)","v":{"$error":"#N/A"}}]
[null,null,null,null,null,null,277,"2017-05-17",{"$f":"Settings!$C$11-((Settings!$C$11-Settings!$E$11)/(Settings!$E$8-Settings!$C$8)*$G282)","v":86.803082191780817},{"$f":"VLOOKUP(H282,data[],2,FALSE)","v":{"$error":"#N/A"}},{"$f":"VLOOKUP(H282,data[],12,FALSE)","v":{"$error":"#N/A"}}]
[null,null,null,null,null,null,278,"2017-05-18",{"$f":"Settings!$C$11-((Settings!$C$11-Settings!$E$11)/(Settings!$E$8-Settings!$C$8)*$G283)","v":86.682876712328778},{"$f":"VLOOKUP(H283,data[],2,FALSE)","v":{"$error":"#N/A"}},{"$f":"VLOOKUP(H283,data[],12,FALSE)","v":{"$error":"#N/A"}}]
[null,null,null,null,null,null,279,"2017-05-19",{"$f":"Settings!$C$11-((Settings!$C$11-Settings!$E$11)/(Settings!$E$8-Settings!$C$8)*$G284)","v":86.56267123287671},{"$f":"VLOOKUP(H284,data[],2,FALSE)","v":{"$error":"#N/A"}},{"$f":"VLOOKUP(H284,data[],12,FALSE)","v":{"$error":"#N/A"}}]
[null,null,null,null,null,null,280,"2017-05-20",{"$f":"Settings!$C$11-((Settings!$C$11-Settings!$E$11)/(Settings!$E$8-Settings!$C$8)*$G285)","v":86.442465753424656},{"$f":"VLOOKUP(H285,data[],2,FALSE)","v":{"$error":"#N/A"}},{"$f":"VLOOKUP(H285,data[],12,FALSE)","v":{"$error":"#N/A"}}]
[null,null,null,null,null,null,281,"2017-05-21",{"$f":"Settings!$C$11-((Settings!$C$11-Settings!$E$11)/(Settings!$E$8-Settings!$C$8)*$G286)","v":86.322260273972603},{"$f":"VLOOKUP(H286,data[],2,FALSE)","v":{"$error":"#N/A"}},{"$f":"VLOOKUP(H286,data[],12,FALSE)","v":{"$error":"#N/A"}}]
[null,null,null,null,null,null,282,"2017-05-22",{"$f":"Settings!$C$11-((Settings!$C$11-Settings!$E$11)/(Settings!$E$8-Settings!$C$8)*$G287)","v":86.202054794520549},{"$f":"VLOOKUP(H287,data[],2,FALSE)","v":{"$error":"#N/A"}},{"$f":"VLOOKUP(H287,data[],12,FALSE)","v":{"$error":"#N/A"}}]
[null,null,null,null,null,null,283,"2017-05-23",{"$f":"Settings!$C$11-((Settings!$C$11-Settings!$E$11)/(Settings!$E$8-Settings!$C$8)*$G288)","v":86.081849315068496},{"$f":"VLOOKUP(H288,data[],2,FALSE)","v":{"$error":"#N/A"}},{"$f":"VLOOKUP(H288,data[],12,FALSE)","v":{"$error":"#N/A"}}]
[null,null,null,null,null,null,284,"2017-05-24",{"$f":"Settings!$C$11-((Settings!$C$11-Settings!$E$11)/(Settings!$E$8-Settings!$C$8)*$G289)","v":85.961643835616442},{"$f":"VLOOKUP(H289,data[],2,FALSE)","v":{"$error":"#N/A"}},{"$f":"VLOOKUP(H289,data[],12,FALSE)","v":{"$error":"#N/A"}}]
[null,null,null,null,null,null,285,"2017-05-25",{"$f":"Settings!$C$11-((Settings!$C$11-Settings!$E$11)/(Settings!$E$8-Settings!$C$8)*$G290)","v":85.841438356164389},{"$f":"VLOOKUP(H290,data[],2,FALSE)","v":{"$error":"#N/A"}},{"$f":"VLOOKUP(H290,data[],12,FALSE)","v":{"$error":"#N/A"}}]
[null,null,null,null,null,null,286,"2017-05-26",{"$f":"Settings!$C$11-((Settings!$C$11-Settings!$E$11)/(Settings!$E$8-Settings!$C$8)*$G291)","v":85.721232876712321},{"$f":"VLOOKUP(H291,data[],2,FALSE)","v":{"$error":"#N/A"}},{"$f":"VLOOKUP(H291,data[],12,FALSE)","v":{"$error":"#N/A"}}]
[null,null,null,null,null,null,287,"2017-05-27",{"$f":"Settings!$C$11-((Settings!$C$11-Settings!$E$11)/(Settings!$E$8-Settings!$C$8)*$G292)","v":85.601027397260282},{"$f":"VLOOKUP(H292,data[],2,FALSE)","v":{"$error":"#N/A"}},{"$f":"VLOOKUP(H292,data[],12,FALSE)","v":{"$error":"#N/A"}}]
[null,null,null,null,null,null,288,"2017-05-28",{"$f":"Settings!$C$11-((Settings!$C$11-Settings!$E$11)/(Settings!$E$8-Settings!$C$8)*$G293)","v":85.480821917808214},{"$f":"VLOOKUP(H293,data[],2,FALSE)","v":{"$error":"#N/A"}},{"$f":"VLOOKUP(H293,data[],12,FALSE)","v":{"$error":"#N/A"}}]
[null,null,null,null,null,null,289,"2017-05-29",{"$f":"Settings!$C$11-((Settings!$C$11-Settings!$E$11)/(Settings!$E$8-Settings!$C$8)*$G294)","v":85.360616438356175},{"$f":"VLOOKUP(H294,data[],2,FALSE)","v":{"$error":"#N/A"}},{"$f":"VLOOKUP(H294,data[],12,FALSE)","v":{"$error":"#N/A"}}]
[null,null,null,null,null,null,290,"2017-05-30",{"$f":"Settings!$C$11-((Settings!$C$11-Settings!$E$11)/(Settings!$E$8-Settings!$C$8)*$G295)","v":85.240410958904107},{"$f":"VLOOKUP(H295,data[],2,FALSE)","v":{"$error":"#N/A"}},{"$f":"VLOOKUP(H295,data[],12,FALSE)","v":{"$error":"#N/A"}}]
[null,null,null,null,null,null,291,"2017-05-31",{"$f":"Settings!$C$11-((Settings!$C$11-Settings!$E$11)/(Settings!$E$8-Settings!$C$8)*$G296)","v":85.120205479452054},{"$f":"VLOOKUP(H296,data[],2,FALSE)","v":{"$error":"#N/A"}},{"$f":"VLOOKUP(H296,data[],12,FALSE)","v":{"$error":"#N/A"}}]
[null,null,null,null,null,null,292,"2017-06-01",{"$f":"Settings!$C$11-((Settings!$C$11-Settings!$E$11)/(Settings!$E$8-Settings!$C$8)*$G297)","v":85},{"$f":"VLOOKUP(H297,data[],2,FALSE)","v":{"$error":"#N/A"}},{"$f":"VLOOKUP(H297,data[],12,FALSE)","v":{"$error":"#N/A"}}]
[null,null,null,null,null,null,293,"2017-06-02",{"$f":"Settings!$C$11-((Settings!$C$11-Settings!$E$11)/(Settings!$E$8-Settings!$C$8)*$G298)","v":84.879794520547946},{"$f":"VLOOKUP(H298,data[],2,FALSE)","v":{"$error":"#N/A"}},{"$f":"VLOOKUP(H298,data[],12,FALSE)","v":{"$error":"#N/A"}}]
[null,null,null,null,null,null,294,"2017-06-03",{"$f":"Settings!$C$11-((Settings!$C$11-Settings!$E$11)/(Settings!$E$8-Settings!$C$8)*$G299)","v":84.759589041095893},{"$f":"VLOOKUP(H299,data[],2,FALSE)","v":{"$error":"#N/A"}},{"$f":"VLOOKUP(H299,data[],12,FALSE)","v":{"$error":"#N/A"}}]
[null,null,null,null,null,null,295,"2017-06-04",{"$f":"Settings!$C$11-((Settings!$C$11-Settings!$E$11)/(Settings!$E$8-Settings!$C$8)*$G300)","v":84.639383561643839},{"$f":"VLOOKUP(H300,data[],2,FALSE)","v":{"$error":"#N/A"}},{"$f":"VLOOKUP(H300,data[],12,FALSE)","v":{"$error":"#N/A"}}]
[null,null,null,null,null,null,296,"2017-06-05",{"$f":"Settings!$C$11-((Settings!$C$11-Settings!$E$11)/(Settings!$E$8-Settings!$C$8)*$G301)","v":84.519178082191786},{"$f":"VLOOKUP(H301,data[],2,FALSE)","v":{"$error":"#N/A"}},{"$f":"VLOOKUP(H301,data[],12,FALSE)","v":{"$error":"#N/A"}}]
[null,null,null,null,null,null,297,"2017-06-06",{"$f":"Settings!$C$11-((Settings!$C$11-Settings!$E$11)/(Settings!$E$8-Settings!$C$8)*$G302)","v":84.398972602739718},{"$f":"VLOOKUP(H302,data[],2,FALSE)","v":{"$error":"#N/A"}},{"$f":"VLOOKUP(H302,data[],12,FALSE)","v":{"$error":"#N/A"}}]
[null,null,null,null,null,null,298,"2017-06-07",{"$f":"Settings!$C$11-((Settings!$C$11-Settings!$E$11)/(Settings!$E$8-Settings!$C$8)*$G303)","v":84.278767123287679},{"$f":"VLOOKUP(H303,data[],2,FALSE)","v":{"$error":"#N/A"}},{"$f":"VLOOKUP(H303,data[],12,FALSE)","v":{"$error":"#N/A"}}]
[null,null,null,null,null,null,299,"2017-06-08",{"$f":"Settings!$C$11-((Settings!$C$11-Settings!$E$11)/(Settings!$E$8-Settings!$C$8)*$G304)","v":84.158561643835611},{"$f":"VLOOKUP(H304,data[],2,FALSE)","v":{"$error":"#N/A"}},{"$f":"VLOOKUP(H304,data[],12,FALSE)","v":{"$error":"#N/A"}}]
[null,null,null,null,null,null,300,"2017-06-09",{"$f":"Settings!$C$11-((Settings!$C$11-Settings!$E$11)/(Settings!$E$8-Settings!$C$8)*$G305)","v":84.038356164383572},{"$f":"VLOOKUP(H305,data[],2,FALSE)","v":{"$error":"#N/A"}},{"$f":"VLOOKUP(H305,data[],12,FALSE)","v":{"$error":"#N/A"}}]
[null,null,null,null,null,null,301,"2017-06-10",{"$f":"Settings!$C$11-((Settings!$C$11-Settings!$E$11)/(Settings!$E$8-Settings!$C$8)*$G306)","v":83.918150684931504},{"$f":"VLOOKUP(H306,data[],2,FALSE)","v":{"$error":"#N/A"}},{"$f":"VLOOKUP(H306,data[],12,FALSE)","v":{"$error":"#N/A"}}]
[null,null,null,null,null,null,302,"2017-06-11",{"$f":"Settings!$C$11-((Settings!$C$11-Settings!$E$11)/(Settings!$E$8-Settings!$C$8)*$G307)","v":83.797945205479451},{"$f":"VLOOKUP(H307,data[],2,FALSE)","v":{"$error":"#N/A"}},{"$f":"VLOOKUP(H307,data[],12,FALSE)","v":{"$error":"#N/A"}}]
[null,null,null,null,null,null,303,"2017-06-12",{"$f":"Settings!$C$11-((Settings!$C$11-Settings!$E$11)/(Settings!$E$8-Settings!$C$8)*$G308)","v":83.677739726027397},{"$f":"VLOOKUP(H308,data[],2,FALSE)","v":{"$error":"#N/A"}},{"$f":"VLOOKUP(H308,data[],12,FALSE)","v":{"$error":"#N/A"}}]
[null,null,null,null,null,null,304,"2017-06-13",{"$f":"Settings!$C$11-((Settings!$C$11-Settings!$E$11)/(Settings!$E$8-Settings!$C$8)*$G309)","v":83.557534246575344},{"$f":"VLOOKUP(H309,data[],2,FALSE)","v":{"$error":"#N/A"}},{"$f":"VLOOKUP(H309,data[],12,FALSE)","v":{"$error":"#N/A"}}]
[null,null,null,null,null,null,305,"2017-06-14",{"$f":"Settings!$C$11-((Settings!$C$11-Settings!$E$11)/(Settings!$E$8-Settings!$C$8)*$G310)","v":83.43732876712329},{"$f":"VLOOKUP(H310,data[],2,FALSE)","v":{"$error":"#N/A"}},{"$f":"VLOOKUP(H310,data[],12,FALSE)","v":{"$error":"#N/A"}}]
[null,null,null,null,null,null,306,"2017-06-15",{"$f":"Settings!$C$11-((Settings!$C$11-Settings!$E$11)/(Settings!$E$8-Settings!$C$8)*$G311)","v":83.317123287671237},{"$f":"VLOOKUP(H311,data[],2,FALSE)","v":{"$error":"#N/A"}},{"$f":"VLOOKUP(H311,data[],12,FALSE)","v":{"$error":"#N/A"}}]
[null,null,null,null,null,null,307,"2017-06-16",{"$f":"Settings!$C$11-((Settings!$C$11-Settings!$E$11)/(Settings!$E$8-Settings!$C$8)*$G312)","v":83.196917808219183},{"$f":"VLOOKUP(H312,data[],2,FALSE)","v":{"$error":"#N/A"}},{"$f":"VLOOKUP(H312,data[],12,FALSE)","v":{"$error":"#N/A"}}]
[null,null,null,null,null,null,308,"2017-06-17",{"$f":"Settings!$C$11-((Settings!$C$11-Settings!$E$11)/(Settings!$E$8-Settings!$C$8)*$G313)","v":83.076712328767115},{"$f":"VLOOKUP(H313,data[],2,FALSE)","v":{"$error":"#N/A"}},{"$f":"VLOOKUP(H313,data[],12,FALSE)","v":{"$error":"#N/A"}}]
[null,null,null,null,null,null,309,"2017-06-18",{"$f":"Settings!$C$11-((Settings!$C$11-Settings!$E$11)/(Settings!$E$8-Settings!$C$8)*$G314)","v":82.956506849315076},{"$f":"VLOOKUP(H314,data[],2,FALSE)","v":{"$error":"#N/A"}},{"$f":"VLOOKUP(H314,data[],12,FALSE)","v":{"$error":"#N/A"}}]
[null,null,null,null,null,null,310,"2017-06-19",{"$f":"Settings!$C$11-((Settings!$C$11-Settings!$E$11)/(Settings!$E$8-Settings!$C$8)*$G315)","v":82.836301369863008},{"$f":"VLOOKUP(H315,data[],2,FALSE)","v":{"$error":"#N/A"}},{"$f":"VLOOKUP(H315,data[],12,FALSE)","v":{"$error":"#N/A"}}]
[null,null,null,null,null,null,311,"2017-06-20",{"$f":"Settings!$C$11-((Settings!$C$11-Settings!$E$11)/(Settings!$E$8-Settings!$C$8)*$G316)","v":82.716095890410969},{"$f":"VLOOKUP(H316,data[],2,FALSE)","v":{"$error":"#N/A"}},{"$f":"VLOOKUP(H316,data[],12,FALSE)","v":{"$error":"#N/A"}}]
[null,null,null,null,null,null,312,"2017-06-21",{"$f":"Settings!$C$11-((Settings!$C$11-Settings!$E$11)/(Settings!$E$8-Settings!$C$8)*$G317)","v":82.595890410958901},{"$f":"VLOOKUP(H317,data[],2,FALSE)","v":{"$error":"#N/A"}},{"$f":"VLOOKUP(H317,data[],12,FALSE)","v":{"$error":"#N/A"}}]
[null,null,null,null,null,null,313,"2017-06-22",{"$f":"Settings!$C$11-((Settings!$C$11-Settings!$E$11)/(Settings!$E$8-Settings!$C$8)*$G318)","v":82.475684931506848},{"$f":"VLOOKUP(H318,data[],2,FALSE)","v":{"$error":"#N/A"}},{"$f":"VLOOKUP(H318,data[],12,FALSE)","v":{"$error":"#N/A"}}]
[null,null,null,null,null,null,314,"2017-06-23",{"$f":"Settings!$C$11-((Settings!$C$11-Settings!$E$11)/(Settings!$E$8-Settings!$C$8)*$G319)","v":82.355479452054794},{"$f":"VLOOKUP(H319,data[],2,FALSE)","v":{"$error":"#N/A"}},{"$f":"VLOOKUP(H319,data[],12,FALSE)","v":{"$error":"#N/A"}}]
[null,null,null,null,null,null,315,"2017-06-24",{"$f":"Settings!$C$11-((Settings!$C$11-Settings!$E$11)/(Settings!$E$8-Settings!$C$8)*$G320)","v":82.235273972602741},{"$f":"VLOOKUP(H320,data[],2,FALSE)","v":{"$error":"#N/A"}},{"$f":"VLOOKUP(H320,data[],12,FALSE)","v":{"$error":"#N/A"}}]
[null,null,null,null,null,null,316,"2017-06-25",{"$f":"Settings!$C$11-((Settings!$C$11-Settings!$E$11)/(Settings!$E$8-Settings!$C$8)*$G321)","v":82.115068493150687},{"$f":"VLOOKUP(H321,data[],2,FALSE)","v":{"$error":"#N/A"}},{"$f":"VLOOKUP(H321,data[],12,FALSE)","v":{"$error":"#N/A"}}]
[null,null,null,null,null,null,317,"2017-06-26",{"$f":"Settings!$C$11-((Settings!$C$11-Settings!$E$11)/(Settings!$E$8-Settings!$C$8)*$G322)","v":81.994863013698634},{"$f":"VLOOKUP(H322,data[],2,FALSE)","v":{"$error":"#N/A"}},{"$f":"VLOOKUP(H322,data[],12,FALSE)","v":{"$error":"#N/A"}}]
[null,null,null,null,null,null,318,"2017-06-27",{"$f":"Settings!$C$11-((Settings!$C$11-Settings!$E$11)/(Settings!$E$8-Settings!$C$8)*$G323)","v":81.87465753424658},{"$f":"VLOOKUP(H323,data[],2,FALSE)","v":{"$error":"#N/A"}},{"$f":"VLOOKUP(H323,data[],12,FALSE)","v":{"$error":"#N/A"}}]
[null,null,null,null,null,null,319,"2017-06-28",{"$f":"Settings!$C$11-((Settings!$C$11-Settings!$E$11)/(Settings!$E$8-Settings!$C$8)*$G324)","v":81.754452054794513},{"$f":"VLOOKUP(H324,data[],2,FALSE)","v":{"$error":"#N/A"}},{"$f":"VLOOKUP(H324,data[],12,FALSE)","v":{"$error":"#N/A"}}]
[null,null,null,null,null,null,320,"2017-06-29",{"$f":"Settings!$C$11-((Settings!$C$11-Settings!$E$11)/(Settings!$E$8-Settings!$C$8)*$G325)","v":81.634246575342473},{"$f":"VLOOKUP(H325,data[],2,FALSE)","v":{"$error":"#N/A"}},{"$f":"VLOOKUP(H325,data[],12,FALSE)","v":{"$error":"#N/A"}}]
[null,null,null,null,null,null,{"$f":"G325+1","v":321},{"$f":"H325+1","v":"2017-06-30"},{"$f":"Settings!$C$11-((Settings!$C$11-Settings!$E$11)/(Settings!$E$8-Settings!$C$8)*$G326)","v":81.514041095890406},{"$f":"VLOOKUP(H326,data[],2,FALSE)","v":{"$error":"#N/A"}},{"$f":"VLOOKUP(H326,data[],12,FALSE)","v":{"$error":"#N/A"}}]
[null,null,null,null,null,null,322,"2017-07-01",{"$f":"Settings!$C$11-((Settings!$C$11-Settings!$E$11)/(Settings!$E$8-Settings!$C$8)*$G327)","v":81.393835616438366},{"$f":"VLOOKUP(H327,data[],2,FALSE)","v":{"$error":"#N/A"}},{"$f":"VLOOKUP(H327,data[],12,FALSE)","v":{"$error":"#N/A"}}]
[null,null,null,null,null,null,323,"2017-07-02",{"$f":"Settings!$C$11-((Settings!$C$11-Settings!$E$11)/(Settings!$E$8-Settings!$C$8)*$G328)","v":81.273630136986299},{"$f":"VLOOKUP(H328,data[],2,FALSE)","v":{"$error":"#N/A"}},{"$f":"VLOOKUP(H328,data[],12,FALSE)","v":{"$error":"#N/A"}}]
[null,null,null,null,null,null,324,"2017-07-03",{"$f":"Settings!$C$11-((Settings!$C$11-Settings!$E$11)/(Settings!$E$8-Settings!$C$8)*$G329)","v":81.153424657534245},{"$f":"VLOOKUP(H329,data[],2,FALSE)","v":{"$error":"#N/A"}},{"$f":"VLOOKUP(H329,data[],12,FALSE)","v":{"$error":"#N/A"}}]
[null,null,null,null,null,null,325,"2017-07-04",{"$f":"Settings!$C$11-((Settings!$C$11-Settings!$E$11)/(Settings!$E$8-Settings!$C$8)*$G330)","v":81.033219178082192},{"$f":"VLOOKUP(H330,data[],2,FALSE)","v":{"$error":"#N/A"}},{"$f":"VLOOKUP(H330,data[],12,FALSE)","v":{"$error":"#N/A"}}]
[null,null,null,null,null,null,326,"2017-07-05",{"$f":"Settings!$C$11-((Settings!$C$11-Settings!$E$11)/(Settings!$E$8-Settings!$C$8)*$G331)","v":80.913013698630138},{"$f":"VLOOKUP(H331,data[],2,FALSE)","v":{"$error":"#N/A"}},{"$f":"VLOOKUP(H331,data[],12,FALSE)","v":{"$error":"#N/A"}}]
[null,null,null,null,null,null,327,"2017-07-06",{"$f":"Settings!$C$11-((Settings!$C$11-Settings!$E$11)/(Settings!$E$8-Settings!$C$8)*$G332)","v":80.792808219178085},{"$f":"VLOOKUP(H332,data[],2,FALSE)","v":{"$error":"#N/A"}},{"$f":"VLOOKUP(H332,data[],12,FALSE)","v":{"$error":"#N/A"}}]
[null,null,null,null,null,null,328,"2017-07-07",{"$f":"Settings!$C$11-((Settings!$C$11-Settings!$E$11)/(Settings!$E$8-Settings!$C$8)*$G333)","v":80.672602739726031},{"$f":"VLOOKUP(H333,data[],2,FALSE)","v":{"$error":"#N/A"}},{"$f":"VLOOKUP(H333,data[],12,FALSE)","v":{"$error":"#N/A"}}]
[null,null,null,null,null,null,329,"2017-07-08",{"$f":"Settings!$C$11-((Settings!$C$11-Settings!$E$11)/(Settings!$E$8-Settings!$C$8)*$G334)","v":80.552397260273978},{"$f":"VLOOKUP(H334,data[],2,FALSE)","v":{"$error":"#N/A"}},{"$f":"VLOOKUP(H334,data[],12,FALSE)","v":{"$error":"#N/A"}}]
[null,null,null,null,null,null,330,"2017-07-09",{"$f":"Settings!$C$11-((Settings!$C$11-Settings!$E$11)/(Settings!$E$8-Settings!$C$8)*$G335)","v":80.43219178082191},{"$f":"VLOOKUP(H335,data[],2,FALSE)","v":{"$error":"#N/A"}},{"$f":"VLOOKUP(H335,data[],12,FALSE)","v":{"$error":"#N/A"}}]
[null,null,null,null,null,null,331,"2017-07-10",{"$f":"Settings!$C$11-((Settings!$C$11-Settings!$E$11)/(Settings!$E$8-Settings!$C$8)*$G336)","v":80.31198630136987},{"$f":"VLOOKUP(H336,data[],2,FALSE)","v":{"$error":"#N/A"}},{"$f":"VLOOKUP(H336,data[],12,FALSE)","v":{"$error":"#N/A"}}]
[null,null,null,null,null,null,332,"2017-07-11",{"$f":"Settings!$C$11-((Settings!$C$11-Settings!$E$11)/(Settings!$E$8-Settings!$C$8)*$G337)","v":80.191780821917803},{"$f":"VLOOKUP(H337,data[],2,FALSE)","v":{"$error":"#N/A"}},{"$f":"VLOOKUP(H337,data[],12,FALSE)","v":{"$error":"#N/A"}}]
[null,null,null,null,null,null,333,"2017-07-12",{"$f":"Settings!$C$11-((Settings!$C$11-Settings!$E$11)/(Settings!$E$8-Settings!$C$8)*$G338)","v":80.071575342465763},{"$f":"VLOOKUP(H338,data[],2,FALSE)","v":{"$error":"#N/A"}},{"$f":"VLOOKUP(H338,data[],12,FALSE)","v":{"$error":"#N/A"}}]
[null,null,null,null,null,null,334,"2017-07-13",{"$f":"Settings!$C$11-((Settings!$C$11-Settings!$E$11)/(Settings!$E$8-Settings!$C$8)*$G339)","v":79.951369863013696},{"$f":"VLOOKUP(H339,data[],2,FALSE)","v":{"$error":"#N/A"}},{"$f":"VLOOKUP(H339,data[],12,FALSE)","v":{"$error":"#N/A"}}]
[null,null,null,null,null,null,335,"2017-07-14",{"$f":"Settings!$C$11-((Settings!$C$11-Settings!$E$11)/(Settings!$E$8-Settings!$C$8)*$G340)","v":79.831164383561642},{"$f":"VLOOKUP(H340,data[],2,FALSE)","v":{"$error":"#N/A"}},{"$f":"VLOOKUP(H340,data[],12,FALSE)","v":{"$error":"#N/A"}}]
[null,null,null,null,null,null,336,"2017-07-15",{"$f":"Settings!$C$11-((Settings!$C$11-Settings!$E$11)/(Settings!$E$8-Settings!$C$8)*$G341)","v":79.710958904109589},{"$f":"VLOOKUP(H341,data[],2,FALSE)","v":{"$error":"#N/A"}},{"$f":"VLOOKUP(H341,data[],12,FALSE)","v":{"$error":"#N/A"}}]
[null,null,null,null,null,null,337,"2017-07-16",{"$f":"Settings!$C$11-((Settings!$C$11-Settings!$E$11)/(Settings!$E$8-Settings!$C$8)*$G342)","v":79.590753424657535},{"$f":"VLOOKUP(H342,data[],2,FALSE)","v":{"$error":"#N/A"}},{"$f":"VLOOKUP(H342,data[],12,FALSE)","v":{"$error":"#N/A"}}]
[null,null,null,null,null,null,338,"2017-07-17",{"$f":"Settings!$C$11-((Settings!$C$11-Settings!$E$11)/(Settings!$E$8-Settings!$C$8)*$G343)","v":79.470547945205482},{"$f":"VLOOKUP(H343,data[],2,FALSE)","v":{"$error":"#N/A"}},{"$f":"VLOOKUP(H343,data[],12,FALSE)","v":{"$error":"#N/A"}}]
[null,null,null,null,null,null,339,"2017-07-18",{"$f":"Settings!$C$11-((Settings!$C$11-Settings!$E$11)/(Settings!$E$8-Settings!$C$8)*$G344)","v":79.350342465753428},{"$f":"VLOOKUP(H344,data[],2,FALSE)","v":{"$error":"#N/A"}},{"$f":"VLOOKUP(H344,data[],12,FALSE)","v":{"$error":"#N/A"}}]
[null,null,null,null,null,null,340,"2017-07-19",{"$f":"Settings!$C$11-((Settings!$C$11-Settings!$E$11)/(Settings!$E$8-Settings!$C$8)*$G345)","v":79.230136986301375},{"$f":"VLOOKUP(H345,data[],2,FALSE)","v":{"$error":"#N/A"}},{"$f":"VLOOKUP(H345,data[],12,FALSE)","v":{"$error":"#N/A"}}]
[null,null,null,null,null,null,341,"2017-07-20",{"$f":"Settings!$C$11-((Settings!$C$11-Settings!$E$11)/(Settings!$E$8-Settings!$C$8)*$G346)","v":79.109931506849307},{"$f":"VLOOKUP(H346,data[],2,FALSE)","v":{"$error":"#N/A"}},{"$f":"VLOOKUP(H346,data[],12,FALSE)","v":{"$error":"#N/A"}}]
[null,null,null,null,null,null,342,"2017-07-21",{"$f":"Settings!$C$11-((Settings!$C$11-Settings!$E$11)/(Settings!$E$8-Settings!$C$8)*$G347)","v":78.989726027397268},{"$f":"VLOOKUP(H347,data[],2,FALSE)","v":{"$error":"#N/A"}},{"$f":"VLOOKUP(H347,data[],12,FALSE)","v":{"$error":"#N/A"}}]
[null,null,null,null,null,null,343,"2017-07-22",{"$f":"Settings!$C$11-((Settings!$C$11-Settings!$E$11)/(Settings!$E$8-Settings!$C$8)*$G348)","v":78.8695205479452},{"$f":"VLOOKUP(H348,data[],2,FALSE)","v":{"$error":"#N/A"}},{"$f":"VLOOKUP(H348,data[],12,FALSE)","v":{"$error":"#N/A"}}]
[null,null,null,null,null,null,344,"2017-07-23",{"$f":"Settings!$C$11-((Settings!$C$11-Settings!$E$11)/(Settings!$E$8-Settings!$C$8)*$G349)","v":78.749315068493161},{"$f":"VLOOKUP(H349,data[],2,FALSE)","v":{"$error":"#N/A"}},{"$f":"VLOOKUP(H349,data[],12,FALSE)","v":{"$error":"#N/A"}}]
[null,null,null,null,null,null,345,"2017-07-24",{"$f":"Settings!$C$11-((Settings!$C$11-Settings!$E$11)/(Settings!$E$8-Settings!$C$8)*$G350)","v":78.629109589041093},{"$f":"VLOOKUP(H350,data[],2,FALSE)","v":{"$error":"#N/A"}},{"$f":"VLOOKUP(H350,data[],12,FALSE)","v":{"$error":"#N/A"}}]
[null,null,null,null,null,null,346,"2017-07-25",{"$f":"Settings!$C$11-((Settings!$C$11-Settings!$E$11)/(Settings!$E$8-Settings!$C$8)*$G351)","v":78.508904109589054},{"$f":"VLOOKUP(H351,data[],2,FALSE)","v":{"$error":"#N/A"}},{"$f":"VLOOKUP(H351,data[],12,FALSE)","v":{"$error":"#N/A"}}]
[null,null,null,null,null,null,347,"2017-07-26",{"$f":"Settings!$C$11-((Settings!$C$11-Settings!$E$11)/(Settings!$E$8-Settings!$C$8)*$G352)","v":78.388698630136986},{"$f":"VLOOKUP(H352,data[],2,FALSE)","v":{"$error":"#N/A"}},{"$f":"VLOOKUP(H352,data[],12,FALSE)","v":{"$error":"#N/A"}}]
[null,null,null,null,null,null,348,"2017-07-27",{"$f":"Settings!$C$11-((Settings!$C$11-Settings!$E$11)/(Settings!$E$8-Settings!$C$8)*$G353)","v":78.268493150684932},{"$f":"VLOOKUP(H353,data[],2,FALSE)","v":{"$error":"#N/A"}},{"$f":"VLOOKUP(H353,data[],12,FALSE)","v":{"$error":"#N/A"}}]
[null,null,null,null,null,null,349,"2017-07-28",{"$f":"Settings!$C$11-((Settings!$C$11-Settings!$E$11)/(Settings!$E$8-Settings!$C$8)*$G354)","v":78.148287671232879},{"$f":"VLOOKUP(H354,data[],2,FALSE)","v":{"$error":"#N/A"}},{"$f":"VLOOKUP(H354,data[],12,FALSE)","v":{"$error":"#N/A"}}]
[null,null,null,null,null,null,350,"2017-07-29",{"$f":"Settings!$C$11-((Settings!$C$11-Settings!$E$11)/(Settings!$E$8-Settings!$C$8)*$G355)","v":78.028082191780825},{"$f":"VLOOKUP(H355,data[],2,FALSE)","v":{"$error":"#N/A"}},{"$f":"VLOOKUP(H355,data[],12,FALSE)","v":{"$error":"#N/A"}}]
[null,null,null,null,null,null,351,"2017-07-30",{"$f":"Settings!$C$11-((Settings!$C$11-Settings!$E$11)/(Settings!$E$8-Settings!$C$8)*$G356)","v":77.907876712328772},{"$f":"VLOOKUP(H356,data[],2,FALSE)","v":{"$error":"#N/A"}},{"$f":"VLOOKUP(H356,data[],12,FALSE)","v":{"$error":"#N/A"}}]
[null,null,null,null,null,null,352,"2017-07-31",{"$f":"Settings!$C$11-((Settings!$C$11-Settings!$E$11)/(Settings!$E$8-Settings!$C$8)*$G357)","v":77.787671232876704},{"$f":"VLOOKUP(H357,data[],2,FALSE)","v":{"$error":"#N/A"}},{"$f":"VLOOKUP(H357,data[],12,FALSE)","v":{"$error":"#N/A"}}]
[null,null,null,null,null,null,353,"2017-08-01",{"$f":"Settings!$C$11-((Settings!$C$11-Settings!$E$11)/(Settings!$E$8-Settings!$C$8)*$G358)","v":77.667465753424665},{"$f":"VLOOKUP(H358,data[],2,FALSE)","v":{"$error":"#N/A"}},{"$f":"VLOOKUP(H358,data[],12,FALSE)","v":{"$error":"#N/A"}}]
[null,null,null,null,null,null,354,"2017-08-02",{"$f":"Settings!$C$11-((Settings!$C$11-Settings!$E$11)/(Settings!$E$8-Settings!$C$8)*$G359)","v":77.547260273972597},{"$f":"VLOOKUP(H359,data[],2,FALSE)","v":{"$error":"#N/A"}},{"$f":"VLOOKUP(H359,data[],12,FALSE)","v":{"$error":"#N/A"}}]
[null,null,null,null,null,null,355,"2017-08-03",{"$f":"Settings!$C$11-((Settings!$C$11-Settings!$E$11)/(Settings!$E$8-Settings!$C$8)*$G360)","v":77.427054794520558},{"$f":"VLOOKUP(H360,data[],2,FALSE)","v":{"$error":"#N/A"}},{"$f":"VLOOKUP(H360,data[],12,FALSE)","v":{"$error":"#N/A"}}]
[null,null,null,null,null,null,356,"2017-08-04",{"$f":"Settings!$C$11-((Settings!$C$11-Settings!$E$11)/(Settings!$E$8-Settings!$C$8)*$G361)","v":77.30684931506849},{"$f":"VLOOKUP(H361,data[],2,FALSE)","v":{"$error":"#N/A"}},{"$f":"VLOOKUP(H361,data[],12,FALSE)","v":{"$error":"#N/A"}}]
[null,null,null,null,null,null,357,"2017-08-05",{"$f":"Settings!$C$11-((Settings!$C$11-Settings!$E$11)/(Settings!$E$8-Settings!$C$8)*$G362)","v":77.186643835616451},{"$f":"VLOOKUP(H362,data[],2,FALSE)","v":{"$error":"#N/A"}},{"$f":"VLOOKUP(H362,data[],12,FALSE)","v":{"$error":"#N/A"}}]
[null,null,null,null,null,null,358,"2017-08-06",{"$f":"Settings!$C$11-((Settings!$C$11-Settings!$E$11)/(Settings!$E$8-Settings!$C$8)*$G363)","v":77.066438356164383},{"$f":"VLOOKUP(H363,data[],2,FALSE)","v":{"$error":"#N/A"}},{"$f":"VLOOKUP(H363,data[],12,FALSE)","v":{"$error":"#N/A"}}]
[null,null,null,null,null,null,359,"2017-08-07",{"$f":"Settings!$C$11-((Settings!$C$11-Settings!$E$11)/(Settings!$E$8-Settings!$C$8)*$G364)","v":76.94623287671233},{"$f":"VLOOKUP(H364,data[],2,FALSE)","v":{"$error":"#N/A"}},{"$f":"VLOOKUP(H364,data[],12,FALSE)","v":{"$error":"#N/A"}}]
[null,null,null,null,null,null,360,"2017-08-08",{"$f":"Settings!$C$11-((Settings!$C$11-Settings!$E$11)/(Settings!$E$8-Settings!$C$8)*$G365)","v":76.826027397260276},{"$f":"VLOOKUP(H365,data[],2,FALSE)","v":{"$error":"#N/A"}},{"$f":"VLOOKUP(H365,data[],12,FALSE)","v":{"$error":"#N/A"}}]
[null,null,null,null,null,null,361,"2017-08-09",{"$f":"Settings!$C$11-((Settings!$C$11-Settings!$E$11)/(Settings!$E$8-Settings!$C$8)*$G366)","v":76.705821917808223},{"$f":"VLOOKUP(H366,data[],2,FALSE)","v":{"$error":"#N/A"}},{"$f":"VLOOKUP(H366,data[],12,FALSE)","v":{"$error":"#N/A"}}]
[null,null,null,null,null,null,362,"2017-08-10",{"$f":"Settings!$C$11-((Settings!$C$11-Settings!$E$11)/(Settings!$E$8-Settings!$C$8)*$G367)","v":76.585616438356169},{"$f":"VLOOKUP(H367,data[],2,FALSE)","v":{"$error":"#N/A"}},{"$f":"VLOOKUP(H367,data[],12,FALSE)","v":{"$error":"#N/A"}}]
[null,null,null,null,null,null,363,"2017-08-11",{"$f":"Settings!$C$11-((Settings!$C$11-Settings!$E$11)/(Settings!$E$8-Settings!$C$8)*$G368)","v":76.465410958904101},{"$f":"VLOOKUP(H368,data[],2,FALSE)","v":{"$error":"#N/A"}},{"$f":"VLOOKUP(H368,data[],12,FALSE)","v":{"$error":"#N/A"}}]
[null,null,null,null,null,null,364,"2017-08-12",{"$f":"Settings!$C$11-((Settings!$C$11-Settings!$E$11)/(Settings!$E$8-Settings!$C$8)*$G369)","v":76.345205479452062},{"$f":"VLOOKUP(H369,data[],2,FALSE)","v":{"$error":"#N/A"}},{"$f":"VLOOKUP(H369,data[],12,FALSE)","v":{"$error":"#N/A"}}]
[null,null,null,null,null,null,365,"2017-08-13",{"$f":"Settings!$C$11-((Settings!$C$11-Settings!$E$11)/(Settings!$E$8-Settings!$C$8)*$G370)","v":76.224999999999994},{"$f":"VLOOKUP(H370,data[],2,FALSE)","v":{"$error":"#N/A"}},{"$f":"VLOOKUP(H370,data[],12,FALSE)","v":{"$error":"#N/A"}}]
[null,null,null,null,null,null,366,"2017-08-14",{"$f":"Settings!$C$11-((Settings!$C$11-Settings!$E$11)/(Settings!$E$8-Settings!$C$8)*$G371)","v":76.104794520547955},{"$f":"VLOOKUP(H371,data[],2,FALSE)","v":{"$error":"#N/A"}},{"$f":"VLOOKUP(H371,data[],12,FALSE)","v":{"$error":"#N/A"}}]
[null,null,null,null,null,null,367,"2017-08-15",{"$f":"Settings!$C$11-((Settings!$C$11-Settings!$E$11)/(Settings!$E$8-Settings!$C$8)*$G372)","v":75.984589041095887},{"$f":"VLOOKUP(H372,data[],2,FALSE)","v":{"$error":"#N/A"}},{"$f":"VLOOKUP(H372,data[],12,FALSE)","v":{"$error":"#N/A"}}]
[null,null,null,null,null,null,368,"2017-08-16",{"$f":"Settings!$C$11-((Settings!$C$11-Settings!$E$11)/(Settings!$E$8-Settings!$C$8)*$G373)","v":75.864383561643848},{"$f":"VLOOKUP(H373,data[],2,FALSE)","v":{"$error":"#N/A"}},{"$f":"VLOOKUP(H373,data[],12,FALSE)","v":{"$error":"#N/A"}}]
[null,null,null,null,null,null,369,"2017-08-17",{"$f":"Settings!$C$11-((Settings!$C$11-Settings!$E$11)/(Settings!$E$8-Settings!$C$8)*$G374)","v":75.74417808219178},{"$f":"VLOOKUP(H374,data[],2,FALSE)","v":{"$error":"#N/A"}},{"$f":"VLOOKUP(H374,data[],12,FALSE)","v":{"$error":"#N/A"}}]
[null,null,null,null,null,null,370,"2017-08-18",{"$f":"Settings!$C$11-((Settings!$C$11-Settings!$E$11)/(Settings!$E$8-Settings!$C$8)*$G375)","v":75.623972602739727},{"$f":"VLOOKUP(H375,data[],2,FALSE)","v":{"$error":"#N/A"}},{"$f":"VLOOKUP(H375,data[],12,FALSE)","v":{"$error":"#N/A"}}]
[null,null,null,null,null,null,371,"2017-08-19",{"$f":"Settings!$C$11-((Settings!$C$11-Settings!$E$11)/(Settings!$E$8-Settings!$C$8)*$G376)","v":75.503767123287673},{"$f":"VLOOKUP(H376,data[],2,FALSE)","v":{"$error":"#N/A"}},{"$f":"VLOOKUP(H376,data[],12,FALSE)","v":{"$error":"#N/A"}}]
[null,null,null,null,null,null,372,"2017-08-20",{"$f":"Settings!$C$11-((Settings!$C$11-Settings!$E$11)/(Settings!$E$8-Settings!$C$8)*$G377)","v":75.38356164383562},{"$f":"VLOOKUP(H377,data[],2,FALSE)","v":{"$error":"#N/A"}},{"$f":"VLOOKUP(H377,data[],12,FALSE)","v":{"$error":"#N/A"}}]
[null,null,null,null,null,null,373,"2017-08-21",{"$f":"Settings!$C$11-((Settings!$C$11-Settings!$E$11)/(Settings!$E$8-Settings!$C$8)*$G378)","v":75.263356164383566},{"$f":"VLOOKUP(H378,data[],2,FALSE)","v":{"$error":"#N/A"}},{"$f":"VLOOKUP(H378,data[],12,FALSE)","v":{"$error":"#N/A"}}]
[null,null,null,null,null,null,374,"2017-08-22",{"$f":"Settings!$C$11-((Settings!$C$11-Settings!$E$11)/(Settings!$E$8-Settings!$C$8)*$G379)","v":75.143150684931513},{"$f":"VLOOKUP(H379,data[],2,FALSE)","v":{"$error":"#N/A"}},{"$f":"VLOOKUP(H379,data[],12,FALSE)","v":{"$error":"#N/A"}}]
[null,null,null,null,null,null,375,"2017-08-23",{"$f":"Settings!$C$11-((Settings!$C$11-Settings!$E$11)/(Settings!$E$8-Settings!$C$8)*$G380)","v":75.022945205479459},{"$f":"VLOOKUP(H380,data[],2,FALSE)","v":{"$error":"#N/A"}},{"$f":"VLOOKUP(H380,data[],12,FALSE)","v":{"$error":"#N/A"}}]
[null,null,null,null,null,null,376,"2017-08-24",{"$f":"Settings!$C$11-((Settings!$C$11-Settings!$E$11)/(Settings!$E$8-Settings!$C$8)*$G381)","v":74.902739726027391},{"$f":"VLOOKUP(H381,data[],2,FALSE)","v":{"$error":"#N/A"}},{"$f":"VLOOKUP(H381,data[],12,FALSE)","v":{"$error":"#N/A"}}]
[null,null,null,null,null,null,377,"2017-08-25",{"$f":"Settings!$C$11-((Settings!$C$11-Settings!$E$11)/(Settings!$E$8-Settings!$C$8)*$G382)","v":74.782534246575352},{"$f":"VLOOKUP(H382,data[],2,FALSE)","v":{"$error":"#N/A"}},{"$f":"VLOOKUP(H382,data[],12,FALSE)","v":{"$error":"#N/A"}}]
[null,null,null,null,null,null,378,"2017-08-26",{"$f":"Settings!$C$11-((Settings!$C$11-Settings!$E$11)/(Settings!$E$8-Settings!$C$8)*$G383)","v":74.662328767123284},{"$f":"VLOOKUP(H383,data[],2,FALSE)","v":{"$error":"#N/A"}},{"$f":"VLOOKUP(H383,data[],12,FALSE)","v":{"$error":"#N/A"}}]
[null,null,null,null,null,null,379,"2017-08-27",{"$f":"Settings!$C$11-((Settings!$C$11-Settings!$E$11)/(Settings!$E$8-Settings!$C$8)*$G384)","v":74.542123287671245},{"$f":"VLOOKUP(H384,data[],2,FALSE)","v":{"$error":"#N/A"}},{"$f":"VLOOKUP(H384,data[],12,FALSE)","v":{"$error":"#N/A"}}]
[null,null,null,null,null,null,380,"2017-08-28",{"$f":"Settings!$C$11-((Settings!$C$11-Settings!$E$11)/(Settings!$E$8-Settings!$C$8)*$G385)","v":74.421917808219177},{"$f":"VLOOKUP(H385,data[],2,FALSE)","v":{"$error":"#N/A"}},{"$f":"VLOOKUP(H385,data[],12,FALSE)","v":{"$error":"#N/A"}}]
[null,null,null,null,null,null,381,"2017-08-29",{"$f":"Settings!$C$11-((Settings!$C$11-Settings!$E$11)/(Settings!$E$8-Settings!$C$8)*$G386)","v":74.301712328767124},{"$f":"VLOOKUP(H386,data[],2,FALSE)","v":{"$error":"#N/A"}},{"$f":"VLOOKUP(H386,data[],12,FALSE)","v":{"$error":"#N/A"}}]
[null,null,null,null,null,null,382,"2017-08-30",{"$f":"Settings!$C$11-((Settings!$C$11-Settings!$E$11)/(Settings!$E$8-Settings!$C$8)*$G387)","v":74.18150684931507},{"$f":"VLOOKUP(H387,data[],2,FALSE)","v":{"$error":"#N/A"}},{"$f":"VLOOKUP(H387,data[],12,FALSE)","v":{"$error":"#N/A"}}]
[null,null,null,null,null,null,383,"2017-08-31",{"$f":"Settings!$C$11-((Settings!$C$11-Settings!$E$11)/(Settings!$E$8-Settings!$C$8)*$G388)","v":74.061301369863017},{"$f":"VLOOKUP(H388,data[],2,FALSE)","v":{"$error":"#N/A"}},{"$f":"VLOOKUP(H388,data[],12,FALSE)","v":{"$error":"#N/A"}}]
[null,null,null,null,null,null,384,"2017-09-01",{"$f":"Settings!$C$11-((Settings!$C$11-Settings!$E$11)/(Settings!$E$8-Settings!$C$8)*$G389)","v":73.941095890410963},{"$f":"VLOOKUP(H389,data[],2,FALSE)","v":{"$error":"#N/A"}},{"$f":"VLOOKUP(H389,data[],12,FALSE)","v":{"$error":"#N/A"}}]
[null,null,null,null,null,null,{"$f":"G389+1","v":385},{"$f":"H389+1","v":"2017-09-02"},{"$f":"Settings!$C$11-((Settings!$C$11-Settings!$E$11)/(Settings!$E$8-Settings!$C$8)*$G390)","v":73.82089041095891},{"$f":"VLOOKUP(H390,data[],2,FALSE)","v":{"$error":"#N/A"}},{"$f":"VLOOKUP(H390,data[],12,FALSE)","v":{"$error":"#N/A"}}]
[null,null,null,null,null,null,386,"2017-09-03",{"$f":"Settings!$C$11-((Settings!$C$11-Settings!$E$11)/(Settings!$E$8-Settings!$C$8)*$G391)","v":73.700684931506856},{"$f":"VLOOKUP(H391,data[],2,FALSE)","v":{"$error":"#N/A"}},{"$f":"VLOOKUP(H391,data[],12,FALSE)","v":{"$error":"#N/A"}}]
[null,null,null,null,null,null,387,"2017-09-04",{"$f":"Settings!$C$11-((Settings!$C$11-Settings!$E$11)/(Settings!$E$8-Settings!$C$8)*$G392)","v":73.580479452054789},{"$f":"VLOOKUP(H392,data[],2,FALSE)","v":{"$error":"#N/A"}},{"$f":"VLOOKUP(H392,data[],12,FALSE)","v":{"$error":"#N/A"}}]
[null,null,null,null,null,null,388,"2017-09-05",{"$f":"Settings!$C$11-((Settings!$C$11-Settings!$E$11)/(Settings!$E$8-Settings!$C$8)*$G393)","v":73.460273972602749},{"$f":"VLOOKUP(H393,data[],2,FALSE)","v":{"$error":"#N/A"}},{"$f":"VLOOKUP(H393,data[],12,FALSE)","v":{"$error":"#N/A"}}]
[null,null,null,null,null,null,389,"2017-09-06",{"$f":"Settings!$C$11-((Settings!$C$11-Settings!$E$11)/(Settings!$E$8-Settings!$C$8)*$G394)","v":73.340068493150682},{"$f":"VLOOKUP(H394,data[],2,FALSE)","v":{"$error":"#N/A"}},{"$f":"VLOOKUP(H394,data[],12,FALSE)","v":{"$error":"#N/A"}}]
[null,null,null,null,null,null,390,"2017-09-07",{"$f":"Settings!$C$11-((Settings!$C$11-Settings!$E$11)/(Settings!$E$8-Settings!$C$8)*$G395)","v":73.219863013698642},{"$f":"VLOOKUP(H395,data[],2,FALSE)","v":{"$error":"#N/A"}},{"$f":"VLOOKUP(H395,data[],12,FALSE)","v":{"$error":"#N/A"}}]
[null,null,null,null,null,null,391,"2017-09-08",{"$f":"Settings!$C$11-((Settings!$C$11-Settings!$E$11)/(Settings!$E$8-Settings!$C$8)*$G396)","v":73.099657534246575},{"$f":"VLOOKUP(H396,data[],2,FALSE)","v":{"$error":"#N/A"}},{"$f":"VLOOKUP(H396,data[],12,FALSE)","v":{"$error":"#N/A"}}]
[null,null,null,null,null,null,392,"2017-09-09",{"$f":"Settings!$C$11-((Settings!$C$11-Settings!$E$11)/(Settings!$E$8-Settings!$C$8)*$G397)","v":72.979452054794521},{"$f":"VLOOKUP(H397,data[],2,FALSE)","v":{"$error":"#N/A"}},{"$f":"VLOOKUP(H397,data[],12,FALSE)","v":{"$error":"#N/A"}}]
[null,null,null,null,null,null,393,"2017-09-10",{"$f":"Settings!$C$11-((Settings!$C$11-Settings!$E$11)/(Settings!$E$8-Settings!$C$8)*$G398)","v":72.859246575342468},{"$f":"VLOOKUP(H398,data[],2,FALSE)","v":{"$error":"#N/A"}},{"$f":"VLOOKUP(H398,data[],12,FALSE)","v":{"$error":"#N/A"}}]
[null,null,null,null,null,null,394,"2017-09-11",{"$f":"Settings!$C$11-((Settings!$C$11-Settings!$E$11)/(Settings!$E$8-Settings!$C$8)*$G399)","v":72.739041095890414},{"$f":"VLOOKUP(H399,data[],2,FALSE)","v":{"$error":"#N/A"}},{"$f":"VLOOKUP(H399,data[],12,FALSE)","v":{"$error":"#N/A"}}]
[null,null,null,null,null,null,395,"2017-09-12",{"$f":"Settings!$C$11-((Settings!$C$11-Settings!$E$11)/(Settings!$E$8-Settings!$C$8)*$G400)","v":72.618835616438361},{"$f":"VLOOKUP(H400,data[],2,FALSE)","v":{"$error":"#N/A"}},{"$f":"VLOOKUP(H400,data[],12,FALSE)","v":{"$error":"#N/A"}}]
[null,null,null,null,null,null,396,"2017-09-13",{"$f":"Settings!$C$11-((Settings!$C$11-Settings!$E$11)/(Settings!$E$8-Settings!$C$8)*$G401)","v":72.498630136986307},{"$f":"VLOOKUP(H401,data[],2,FALSE)","v":{"$error":"#N/A"}},{"$f":"VLOOKUP(H401,data[],12,FALSE)","v":{"$error":"#N/A"}}]
[null,null,null,null,null,null,397,"2017-09-14",{"$f":"Settings!$C$11-((Settings!$C$11-Settings!$E$11)/(Settings!$E$8-Settings!$C$8)*$G402)","v":72.378424657534254},{"$f":"VLOOKUP(H402,data[],2,FALSE)","v":{"$error":"#N/A"}},{"$f":"VLOOKUP(H402,data[],12,FALSE)","v":{"$error":"#N/A"}}]
[null,null,null,null,null,null,398,"2017-09-15",{"$f":"Settings!$C$11-((Settings!$C$11-Settings!$E$11)/(Settings!$E$8-Settings!$C$8)*$G403)","v":72.258219178082186},{"$f":"VLOOKUP(H403,data[],2,FALSE)","v":{"$error":"#N/A"}},{"$f":"VLOOKUP(H403,data[],12,FALSE)","v":{"$error":"#N/A"}}]
[null,null,null,null,null,null,399,"2017-09-16",{"$f":"Settings!$C$11-((Settings!$C$11-Settings!$E$11)/(Settings!$E$8-Settings!$C$8)*$G404)","v":72.138013698630147},{"$f":"VLOOKUP(H404,data[],2,FALSE)","v":{"$error":"#N/A"}},{"$f":"VLOOKUP(H404,data[],12,FALSE)","v":{"$error":"#N/A"}}]
[null,null,null,null,null,null,400,"2017-09-17",{"$f":"Settings!$C$11-((Settings!$C$11-Settings!$E$11)/(Settings!$E$8-Settings!$C$8)*$G405)","v":72.017808219178079},{"$f":"VLOOKUP(H405,data[],2,FALSE)","v":{"$error":"#N/A"}},{"$f":"VLOOKUP(H405,data[],12,FALSE)","v":{"$error":"#N/A"}}]
[null,null,null,null,null,null,401,"2017-09-18",{"$f":"Settings!$C$11-((Settings!$C$11-Settings!$E$11)/(Settings!$E$8-Settings!$C$8)*$G406)","v":71.89760273972604},{"$f":"VLOOKUP(H406,data[],2,FALSE)","v":{"$error":"#N/A"}},{"$f":"VLOOKUP(H406,data[],12,FALSE)","v":{"$error":"#N/A"}}]
[null,null,null,null,null,null,402,"2017-09-19",{"$f":"Settings!$C$11-((Settings!$C$11-Settings!$E$11)/(Settings!$E$8-Settings!$C$8)*$G407)","v":71.777397260273972},{"$f":"VLOOKUP(H407,data[],2,FALSE)","v":{"$error":"#N/A"}},{"$f":"VLOOKUP(H407,data[],12,FALSE)","v":{"$error":"#N/A"}}]
[null,null,null,null,null,null,403,"2017-09-20",{"$f":"Settings!$C$11-((Settings!$C$11-Settings!$E$11)/(Settings!$E$8-Settings!$C$8)*$G408)","v":71.657191780821918},{"$f":"VLOOKUP(H408,data[],2,FALSE)","v":{"$error":"#N/A"}},{"$f":"VLOOKUP(H408,data[],12,FALSE)","v":{"$error":"#N/A"}}]
[null,null,null,null,null,null,404,"2017-09-21",{"$f":"Settings!$C$11-((Settings!$C$11-Settings!$E$11)/(Settings!$E$8-Settings!$C$8)*$G409)","v":71.536986301369865},{"$f":"VLOOKUP(H409,data[],2,FALSE)","v":{"$error":"#N/A"}},{"$f":"VLOOKUP(H409,data[],12,FALSE)","v":{"$error":"#N/A"}}]
[null,null,null,null,null,null,405,"2017-09-22",{"$f":"Settings!$C$11-((Settings!$C$11-Settings!$E$11)/(Settings!$E$8-Settings!$C$8)*$G410)","v":71.416780821917811},{"$f":"VLOOKUP(H410,data[],2,FALSE)","v":{"$error":"#N/A"}},{"$f":"VLOOKUP(H410,data[],12,FALSE)","v":{"$error":"#N/A"}}]
[null,null,null,null,null,null,406,"2017-09-23",{"$f":"Settings!$C$11-((Settings!$C$11-Settings!$E$11)/(Settings!$E$8-Settings!$C$8)*$G411)","v":71.296575342465758},{"$f":"VLOOKUP(H411,data[],2,FALSE)","v":{"$error":"#N/A"}},{"$f":"VLOOKUP(H411,data[],12,FALSE)","v":{"$error":"#N/A"}}]
[null,null,null,null,null,null,407,"2017-09-24",{"$f":"Settings!$C$11-((Settings!$C$11-Settings!$E$11)/(Settings!$E$8-Settings!$C$8)*$G412)","v":71.176369863013704},{"$f":"VLOOKUP(H412,data[],2,FALSE)","v":{"$error":"#N/A"}},{"$f":"VLOOKUP(H412,data[],12,FALSE)","v":{"$error":"#N/A"}}]
[null,null,null,null,null,null,408,"2017-09-25",{"$f":"Settings!$C$11-((Settings!$C$11-Settings!$E$11)/(Settings!$E$8-Settings!$C$8)*$G413)","v":71.056164383561651},{"$f":"VLOOKUP(H413,data[],2,FALSE)","v":{"$error":"#N/A"}},{"$f":"VLOOKUP(H413,data[],12,FALSE)","v":{"$error":"#N/A"}}]
[null,null,null,null,null,null,409,"2017-09-26",{"$f":"Settings!$C$11-((Settings!$C$11-Settings!$E$11)/(Settings!$E$8-Settings!$C$8)*$G414)","v":70.935958904109583},{"$f":"VLOOKUP(H414,data[],2,FALSE)","v":{"$error":"#N/A"}},{"$f":"VLOOKUP(H414,data[],12,FALSE)","v":{"$error":"#N/A"}}]
[null,null,null,null,null,null,410,"2017-09-27",{"$f":"Settings!$C$11-((Settings!$C$11-Settings!$E$11)/(Settings!$E$8-Settings!$C$8)*$G415)","v":70.815753424657544},{"$f":"VLOOKUP(H415,data[],2,FALSE)","v":{"$error":"#N/A"}},{"$f":"VLOOKUP(H415,data[],12,FALSE)","v":{"$error":"#N/A"}}]
[null,null,null,null,null,null,411,"2017-09-28",{"$f":"Settings!$C$11-((Settings!$C$11-Settings!$E$11)/(Settings!$E$8-Settings!$C$8)*$G416)","v":70.695547945205476},{"$f":"VLOOKUP(H416,data[],2,FALSE)","v":{"$error":"#N/A"}},{"$f":"VLOOKUP(H416,data[],12,FALSE)","v":{"$error":"#N/A"}}]
[null,null,null,null,null,null,412,"2017-09-29",{"$f":"Settings!$C$11-((Settings!$C$11-Settings!$E$11)/(Settings!$E$8-Settings!$C$8)*$G417)","v":70.575342465753437},{"$f":"VLOOKUP(H417,data[],2,FALSE)","v":{"$error":"#N/A"}},{"$f":"VLOOKUP(H417,data[],12,FALSE)","v":{"$error":"#N/A"}}]
[null,null,null,null,null,null,413,"2017-09-30",{"$f":"Settings!$C$11-((Settings!$C$11-Settings!$E$11)/(Settings!$E$8-Settings!$C$8)*$G418)","v":70.455136986301369},{"$f":"VLOOKUP(H418,data[],2,FALSE)","v":{"$error":"#N/A"}},{"$f":"VLOOKUP(H418,data[],12,FALSE)","v":{"$error":"#N/A"}}]
[null,null,null,null,null,null,414,"2017-10-01",{"$f":"Settings!$C$11-((Settings!$C$11-Settings!$E$11)/(Settings!$E$8-Settings!$C$8)*$G419)","v":70.334931506849315},{"$f":"VLOOKUP(H419,data[],2,FALSE)","v":{"$error":"#N/A"}},{"$f":"VLOOKUP(H419,data[],12,FALSE)","v":{"$error":"#N/A"}}]
[null,null,null,null,null,null,415,"2017-10-02",{"$f":"Settings!$C$11-((Settings!$C$11-Settings!$E$11)/(Settings!$E$8-Settings!$C$8)*$G420)","v":70.214726027397262},{"$f":"VLOOKUP(H420,data[],2,FALSE)","v":{"$error":"#N/A"}},{"$f":"VLOOKUP(H420,data[],12,FALSE)","v":{"$error":"#N/A"}}]
[null,null,null,null,null,null,416,"2017-10-03",{"$f":"Settings!$C$11-((Settings!$C$11-Settings!$E$11)/(Settings!$E$8-Settings!$C$8)*$G421)","v":70.094520547945208},{"$f":"VLOOKUP(H421,data[],2,FALSE)","v":{"$error":"#N/A"}},{"$f":"VLOOKUP(H421,data[],12,FALSE)","v":{"$error":"#N/A"}}]
[null,null,null,null,null,null,417,"2017-10-04",{"$f":"Settings!$C$11-((Settings!$C$11-Settings!$E$11)/(Settings!$E$8-Settings!$C$8)*$G422)","v":69.974315068493155},{"$f":"VLOOKUP(H422,data[],2,FALSE)","v":{"$error":"#N/A"}},{"$f":"VLOOKUP(H422,data[],12,FALSE)","v":{"$error":"#N/A"}}]
[null,null,null,null,null,null,418,"2017-10-05",{"$f":"Settings!$C$11-((Settings!$C$11-Settings!$E$11)/(Settings!$E$8-Settings!$C$8)*$G423)","v":69.854109589041101},{"$f":"VLOOKUP(H423,data[],2,FALSE)","v":{"$error":"#N/A"}},{"$f":"VLOOKUP(H423,data[],12,FALSE)","v":{"$error":"#N/A"}}]
[null,null,null,null,null,null,419,"2017-10-06",{"$f":"Settings!$C$11-((Settings!$C$11-Settings!$E$11)/(Settings!$E$8-Settings!$C$8)*$G424)","v":69.733904109589048},{"$f":"VLOOKUP(H424,data[],2,FALSE)","v":{"$error":"#N/A"}},{"$f":"VLOOKUP(H424,data[],12,FALSE)","v":{"$error":"#N/A"}}]
[null,null,null,null,null,null,420,"2017-10-07",{"$f":"Settings!$C$11-((Settings!$C$11-Settings!$E$11)/(Settings!$E$8-Settings!$C$8)*$G425)","v":69.61369863013698},{"$f":"VLOOKUP(H425,data[],2,FALSE)","v":{"$error":"#N/A"}},{"$f":"VLOOKUP(H425,data[],12,FALSE)","v":{"$error":"#N/A"}}]
[null,null,null,null,null,null,421,"2017-10-08",{"$f":"Settings!$C$11-((Settings!$C$11-Settings!$E$11)/(Settings!$E$8-Settings!$C$8)*$G426)","v":69.493493150684941},{"$f":"VLOOKUP(H426,data[],2,FALSE)","v":{"$error":"#N/A"}},{"$f":"VLOOKUP(H426,data[],12,FALSE)","v":{"$error":"#N/A"}}]
[null,null,null,null,null,null,422,"2017-10-09",{"$f":"Settings!$C$11-((Settings!$C$11-Settings!$E$11)/(Settings!$E$8-Settings!$C$8)*$G427)","v":69.373287671232873},{"$f":"VLOOKUP(H427,data[],2,FALSE)","v":{"$error":"#N/A"}},{"$f":"VLOOKUP(H427,data[],12,FALSE)","v":{"$error":"#N/A"}}]
[null,null,null,null,null,null,423,"2017-10-10",{"$f":"Settings!$C$11-((Settings!$C$11-Settings!$E$11)/(Settings!$E$8-Settings!$C$8)*$G428)","v":69.253082191780834},{"$f":"VLOOKUP(H428,data[],2,FALSE)","v":{"$error":"#N/A"}},{"$f":"VLOOKUP(H428,data[],12,FALSE)","v":{"$error":"#N/A"}}]
[null,null,null,null,null,null,424,"2017-10-11",{"$f":"Settings!$C$11-((Settings!$C$11-Settings!$E$11)/(Settings!$E$8-Settings!$C$8)*$G429)","v":69.132876712328766},{"$f":"VLOOKUP(H429,data[],2,FALSE)","v":{"$error":"#N/A"}},{"$f":"VLOOKUP(H429,data[],12,FALSE)","v":{"$error":"#N/A"}}]
[null,null,null,null,null,null,425,"2017-10-12",{"$f":"Settings!$C$11-((Settings!$C$11-Settings!$E$11)/(Settings!$E$8-Settings!$C$8)*$G430)","v":69.012671232876713},{"$f":"VLOOKUP(H430,data[],2,FALSE)","v":{"$error":"#N/A"}},{"$f":"VLOOKUP(H430,data[],12,FALSE)","v":{"$error":"#N/A"}}]
[null,null,null,null,null,null,426,"2017-10-13",{"$f":"Settings!$C$11-((Settings!$C$11-Settings!$E$11)/(Settings!$E$8-Settings!$C$8)*$G431)","v":68.892465753424659},{"$f":"VLOOKUP(H431,data[],2,FALSE)","v":{"$error":"#N/A"}},{"$f":"VLOOKUP(H431,data[],12,FALSE)","v":{"$error":"#N/A"}}]
[null,null,null,null,null,null,427,"2017-10-14",{"$f":"Settings!$C$11-((Settings!$C$11-Settings!$E$11)/(Settings!$E$8-Settings!$C$8)*$G432)","v":68.772260273972606},{"$f":"VLOOKUP(H432,data[],2,FALSE)","v":{"$error":"#N/A"}},{"$f":"VLOOKUP(H432,data[],12,FALSE)","v":{"$error":"#N/A"}}]
[null,null,null,null,null,null,428,"2017-10-15",{"$f":"Settings!$C$11-((Settings!$C$11-Settings!$E$11)/(Settings!$E$8-Settings!$C$8)*$G433)","v":68.652054794520552},{"$f":"VLOOKUP(H433,data[],2,FALSE)","v":{"$error":"#N/A"}},{"$f":"VLOOKUP(H433,data[],12,FALSE)","v":{"$error":"#N/A"}}]
[null,null,null,null,null,null,429,"2017-10-16",{"$f":"Settings!$C$11-((Settings!$C$11-Settings!$E$11)/(Settings!$E$8-Settings!$C$8)*$G434)","v":68.531849315068499},{"$f":"VLOOKUP(H434,data[],2,FALSE)","v":{"$error":"#N/A"}},{"$f":"VLOOKUP(H434,data[],12,FALSE)","v":{"$error":"#N/A"}}]
[null,null,null,null,null,null,430,"2017-10-17",{"$f":"Settings!$C$11-((Settings!$C$11-Settings!$E$11)/(Settings!$E$8-Settings!$C$8)*$G435)","v":68.411643835616445},{"$f":"VLOOKUP(H435,data[],2,FALSE)","v":{"$error":"#N/A"}},{"$f":"VLOOKUP(H435,data[],12,FALSE)","v":{"$error":"#N/A"}}]
[null,null,null,null,null,null,431,"2017-10-18",{"$f":"Settings!$C$11-((Settings!$C$11-Settings!$E$11)/(Settings!$E$8-Settings!$C$8)*$G436)","v":68.291438356164377},{"$f":"VLOOKUP(H436,data[],2,FALSE)","v":{"$error":"#N/A"}},{"$f":"VLOOKUP(H436,data[],12,FALSE)","v":{"$error":"#N/A"}}]
[null,null,null,null,null,null,432,"2017-10-19",{"$f":"Settings!$C$11-((Settings!$C$11-Settings!$E$11)/(Settings!$E$8-Settings!$C$8)*$G437)","v":68.171232876712338},{"$f":"VLOOKUP(H437,data[],2,FALSE)","v":{"$error":"#N/A"}},{"$f":"VLOOKUP(H437,data[],12,FALSE)","v":{"$error":"#N/A"}}]
[null,null,null,null,null,null,433,"2017-10-20",{"$f":"Settings!$C$11-((Settings!$C$11-Settings!$E$11)/(Settings!$E$8-Settings!$C$8)*$G438)","v":68.05102739726027},{"$f":"VLOOKUP(H438,data[],2,FALSE)","v":{"$error":"#N/A"}},{"$f":"VLOOKUP(H438,data[],12,FALSE)","v":{"$error":"#N/A"}}]
[null,null,null,null,null,null,434,"2017-10-21",{"$f":"Settings!$C$11-((Settings!$C$11-Settings!$E$11)/(Settings!$E$8-Settings!$C$8)*$G439)","v":67.930821917808231},{"$f":"VLOOKUP(H439,data[],2,FALSE)","v":{"$error":"#N/A"}},{"$f":"VLOOKUP(H439,data[],12,FALSE)","v":{"$error":"#N/A"}}]
[null,null,null,null,null,null,435,"2017-10-22",{"$f":"Settings!$C$11-((Settings!$C$11-Settings!$E$11)/(Settings!$E$8-Settings!$C$8)*$G440)","v":67.810616438356163},{"$f":"VLOOKUP(H440,data[],2,FALSE)","v":{"$error":"#N/A"}},{"$f":"VLOOKUP(H440,data[],12,FALSE)","v":{"$error":"#N/A"}}]
[null,null,null,null,null,null,436,"2017-10-23",{"$f":"Settings!$C$11-((Settings!$C$11-Settings!$E$11)/(Settings!$E$8-Settings!$C$8)*$G441)","v":67.690410958904124},{"$f":"VLOOKUP(H441,data[],2,FALSE)","v":{"$error":"#N/A"}},{"$f":"VLOOKUP(H441,data[],12,FALSE)","v":{"$error":"#N/A"}}]
[null,null,null,null,null,null,437,"2017-10-24",{"$f":"Settings!$C$11-((Settings!$C$11-Settings!$E$11)/(Settings!$E$8-Settings!$C$8)*$G442)","v":67.570205479452056},{"$f":"VLOOKUP(H442,data[],2,FALSE)","v":{"$error":"#N/A"}},{"$f":"VLOOKUP(H442,data[],12,FALSE)","v":{"$error":"#N/A"}}]
[null,null,null,null,null,null,438,"2017-10-25",{"$f":"Settings!$C$11-((Settings!$C$11-Settings!$E$11)/(Settings!$E$8-Settings!$C$8)*$G443)","v":67.45},{"$f":"VLOOKUP(H443,data[],2,FALSE)","v":{"$error":"#N/A"}},{"$f":"VLOOKUP(H443,data[],12,FALSE)","v":{"$error":"#N/A"}}]
[null,null,null,null,null,null,439,"2017-10-26",{"$f":"Settings!$C$11-((Settings!$C$11-Settings!$E$11)/(Settings!$E$8-Settings!$C$8)*$G444)","v":67.329794520547949},{"$f":"VLOOKUP(H444,data[],2,FALSE)","v":{"$error":"#N/A"}},{"$f":"VLOOKUP(H444,data[],12,FALSE)","v":{"$error":"#N/A"}}]
[null,null,null,null,null,null,440,"2017-10-27",{"$f":"Settings!$C$11-((Settings!$C$11-Settings!$E$11)/(Settings!$E$8-Settings!$C$8)*$G445)","v":67.209589041095896},{"$f":"VLOOKUP(H445,data[],2,FALSE)","v":{"$error":"#N/A"}},{"$f":"VLOOKUP(H445,data[],12,FALSE)","v":{"$error":"#N/A"}}]
[null,null,null,null,null,null,441,"2017-10-28",{"$f":"Settings!$C$11-((Settings!$C$11-Settings!$E$11)/(Settings!$E$8-Settings!$C$8)*$G446)","v":67.089383561643842},{"$f":"VLOOKUP(H446,data[],2,FALSE)","v":{"$error":"#N/A"}},{"$f":"VLOOKUP(H446,data[],12,FALSE)","v":{"$error":"#N/A"}}]
[null,null,null,null,null,null,442,"2017-10-29",{"$f":"Settings!$C$11-((Settings!$C$11-Settings!$E$11)/(Settings!$E$8-Settings!$C$8)*$G447)","v":66.969178082191775},{"$f":"VLOOKUP(H447,data[],2,FALSE)","v":{"$error":"#N/A"}},{"$f":"VLOOKUP(H447,data[],12,FALSE)","v":{"$error":"#N/A"}}]
[null,null,null,null,null,null,443,"2017-10-30",{"$f":"Settings!$C$11-((Settings!$C$11-Settings!$E$11)/(Settings!$E$8-Settings!$C$8)*$G448)","v":66.848972602739735},{"$f":"VLOOKUP(H448,data[],2,FALSE)","v":{"$error":"#N/A"}},{"$f":"VLOOKUP(H448,data[],12,FALSE)","v":{"$error":"#N/A"}}]
[null,null,null,null,null,null,444,"2017-10-31",{"$f":"Settings!$C$11-((Settings!$C$11-Settings!$E$11)/(Settings!$E$8-Settings!$C$8)*$G449)","v":66.728767123287668},{"$f":"VLOOKUP(H449,data[],2,FALSE)","v":{"$error":"#N/A"}},{"$f":"VLOOKUP(H449,data[],12,FALSE)","v":{"$error":"#N/A"}}]
[null,null,null,null,null,null,445,"2017-11-01",{"$f":"Settings!$C$11-((Settings!$C$11-Settings!$E$11)/(Settings!$E$8-Settings!$C$8)*$G450)","v":66.608561643835628},{"$f":"VLOOKUP(H450,data[],2,FALSE)","v":{"$error":"#N/A"}},{"$f":"VLOOKUP(H450,data[],12,FALSE)","v":{"$error":"#N/A"}}]
[null,null,null,null,null,null,446,"2017-11-02",{"$f":"Settings!$C$11-((Settings!$C$11-Settings!$E$11)/(Settings!$E$8-Settings!$C$8)*$G451)","v":66.488356164383561},{"$f":"VLOOKUP(H451,data[],2,FALSE)","v":{"$error":"#N/A"}},{"$f":"VLOOKUP(H451,data[],12,FALSE)","v":{"$error":"#N/A"}}]
[null,null,null,null,null,null,447,"2017-11-03",{"$f":"Settings!$C$11-((Settings!$C$11-Settings!$E$11)/(Settings!$E$8-Settings!$C$8)*$G452)","v":66.368150684931521},{"$f":"VLOOKUP(H452,data[],2,FALSE)","v":{"$error":"#N/A"}},{"$f":"VLOOKUP(H452,data[],12,FALSE)","v":{"$error":"#N/A"}}]
[null,null,null,null,null,null,448,"2017-11-04",{"$f":"Settings!$C$11-((Settings!$C$11-Settings!$E$11)/(Settings!$E$8-Settings!$C$8)*$G453)","v":66.247945205479454},{"$f":"VLOOKUP(H453,data[],2,FALSE)","v":{"$error":"#N/A"}},{"$f":"VLOOKUP(H453,data[],12,FALSE)","v":{"$error":"#N/A"}}]
[null,null,null,null,null,null,{"$f":"G453+1","v":449},{"$f":"H453+1","v":"2017-11-05"},{"$f":"Settings!$C$11-((Settings!$C$11-Settings!$E$11)/(Settings!$E$8-Settings!$C$8)*$G454)","v":66.1277397260274},{"$f":"VLOOKUP(H454,data[],2,FALSE)","v":{"$error":"#N/A"}},{"$f":"VLOOKUP(H454,data[],12,FALSE)","v":{"$error":"#N/A"}}]
[null,null,null,null,null,null,450,"2017-11-06",{"$f":"Settings!$C$11-((Settings!$C$11-Settings!$E$11)/(Settings!$E$8-Settings!$C$8)*$G455)","v":66.007534246575347},{"$f":"VLOOKUP(H455,data[],2,FALSE)","v":{"$error":"#N/A"}},{"$f":"VLOOKUP(H455,data[],12,FALSE)","v":{"$error":"#N/A"}}]
[null,null,null,null,null,null,451,"2017-11-07",{"$f":"Settings!$C$11-((Settings!$C$11-Settings!$E$11)/(Settings!$E$8-Settings!$C$8)*$G456)","v":65.887328767123293},{"$f":"VLOOKUP(H456,data[],2,FALSE)","v":{"$error":"#N/A"}},{"$f":"VLOOKUP(H456,data[],12,FALSE)","v":{"$error":"#N/A"}}]
[null,null,null,null,null,null,452,"2017-11-08",{"$f":"Settings!$C$11-((Settings!$C$11-Settings!$E$11)/(Settings!$E$8-Settings!$C$8)*$G457)","v":65.767123287671239},{"$f":"VLOOKUP(H457,data[],2,FALSE)","v":{"$error":"#N/A"}},{"$f":"VLOOKUP(H457,data[],12,FALSE)","v":{"$error":"#N/A"}}]
[null,null,null,null,null,null,453,"2017-11-09",{"$f":"Settings!$C$11-((Settings!$C$11-Settings!$E$11)/(Settings!$E$8-Settings!$C$8)*$G458)","v":65.646917808219172},{"$f":"VLOOKUP(H458,data[],2,FALSE)","v":{"$error":"#N/A"}},{"$f":"VLOOKUP(H458,data[],12,FALSE)","v":{"$error":"#N/A"}}]
[null,null,null,null,null,null,454,"2017-11-10",{"$f":"Settings!$C$11-((Settings!$C$11-Settings!$E$11)/(Settings!$E$8-Settings!$C$8)*$G459)","v":65.526712328767132},{"$f":"VLOOKUP(H459,data[],2,FALSE)","v":{"$error":"#N/A"}},{"$f":"VLOOKUP(H459,data[],12,FALSE)","v":{"$error":"#N/A"}}]
[null,null,null,null,null,null,455,"2017-11-11",{"$f":"Settings!$C$11-((Settings!$C$11-Settings!$E$11)/(Settings!$E$8-Settings!$C$8)*$G460)","v":65.406506849315065},{"$f":"VLOOKUP(H460,data[],2,FALSE)","v":{"$error":"#N/A"}},{"$f":"VLOOKUP(H460,data[],12,FALSE)","v":{"$error":"#N/A"}}]
[null,null,null,null,null,null,456,"2017-11-12",{"$f":"Settings!$C$11-((Settings!$C$11-Settings!$E$11)/(Settings!$E$8-Settings!$C$8)*$G461)","v":65.286301369863025},{"$f":"VLOOKUP(H461,data[],2,FALSE)","v":{"$error":"#N/A"}},{"$f":"VLOOKUP(H461,data[],12,FALSE)","v":{"$error":"#N/A"}}]
[null,null,null,null,null,null,457,"2017-11-13",{"$f":"Settings!$C$11-((Settings!$C$11-Settings!$E$11)/(Settings!$E$8-Settings!$C$8)*$G462)","v":65.166095890410958},{"$f":"VLOOKUP(H462,data[],2,FALSE)","v":{"$error":"#N/A"}},{"$f":"VLOOKUP(H462,data[],12,FALSE)","v":{"$error":"#N/A"}}]
[null,null,null,null,null,null,458,"2017-11-14",{"$f":"Settings!$C$11-((Settings!$C$11-Settings!$E$11)/(Settings!$E$8-Settings!$C$8)*$G463)","v":65.045890410958918},{"$f":"VLOOKUP(H463,data[],2,FALSE)","v":{"$error":"#N/A"}},{"$f":"VLOOKUP(H463,data[],12,FALSE)","v":{"$error":"#N/A"}}]
[null,null,null,null,null,null,459,"2017-11-15",{"$f":"Settings!$C$11-((Settings!$C$11-Settings!$E$11)/(Settings!$E$8-Settings!$C$8)*$G464)","v":64.925684931506851},{"$f":"VLOOKUP(H464,data[],2,FALSE)","v":{"$error":"#N/A"}},{"$f":"VLOOKUP(H464,data[],12,FALSE)","v":{"$error":"#N/A"}}]
[null,null,null,null,null,null,460,"2017-11-16",{"$f":"Settings!$C$11-((Settings!$C$11-Settings!$E$11)/(Settings!$E$8-Settings!$C$8)*$G465)","v":64.805479452054797},{"$f":"VLOOKUP(H465,data[],2,FALSE)","v":{"$error":"#N/A"}},{"$f":"VLOOKUP(H465,data[],12,FALSE)","v":{"$error":"#N/A"}}]
[null,null,null,null,null,null,461,"2017-11-17",{"$f":"Settings!$C$11-((Settings!$C$11-Settings!$E$11)/(Settings!$E$8-Settings!$C$8)*$G466)","v":64.685273972602744},{"$f":"VLOOKUP(H466,data[],2,FALSE)","v":{"$error":"#N/A"}},{"$f":"VLOOKUP(H466,data[],12,FALSE)","v":{"$error":"#N/A"}}]
[null,null,null,null,null,null,462,"2017-11-18",{"$f":"Settings!$C$11-((Settings!$C$11-Settings!$E$11)/(Settings!$E$8-Settings!$C$8)*$G467)","v":64.56506849315069},{"$f":"VLOOKUP(H467,data[],2,FALSE)","v":{"$error":"#N/A"}},{"$f":"VLOOKUP(H467,data[],12,FALSE)","v":{"$error":"#N/A"}}]
[null,null,null,null,null,null,463,"2017-11-19",{"$f":"Settings!$C$11-((Settings!$C$11-Settings!$E$11)/(Settings!$E$8-Settings!$C$8)*$G468)","v":64.444863013698637},{"$f":"VLOOKUP(H468,data[],2,FALSE)","v":{"$error":"#N/A"}},{"$f":"VLOOKUP(H468,data[],12,FALSE)","v":{"$error":"#N/A"}}]
[null,null,null,null,null,null,464,"2017-11-20",{"$f":"Settings!$C$11-((Settings!$C$11-Settings!$E$11)/(Settings!$E$8-Settings!$C$8)*$G469)","v":64.324657534246583},{"$f":"VLOOKUP(H469,data[],2,FALSE)","v":{"$error":"#N/A"}},{"$f":"VLOOKUP(H469,data[],12,FALSE)","v":{"$error":"#N/A"}}]
[null,null,null,null,null,null,465,"2017-11-21",{"$f":"Settings!$C$11-((Settings!$C$11-Settings!$E$11)/(Settings!$E$8-Settings!$C$8)*$G470)","v":64.20445205479453},{"$f":"VLOOKUP(H470,data[],2,FALSE)","v":{"$error":"#N/A"}},{"$f":"VLOOKUP(H470,data[],12,FALSE)","v":{"$error":"#N/A"}}]
[null,null,null,null,null,null,466,"2017-11-22",{"$f":"Settings!$C$11-((Settings!$C$11-Settings!$E$11)/(Settings!$E$8-Settings!$C$8)*$G471)","v":64.084246575342462},{"$f":"VLOOKUP(H471,data[],2,FALSE)","v":{"$error":"#N/A"}},{"$f":"VLOOKUP(H471,data[],12,FALSE)","v":{"$error":"#N/A"}}]
[null,null,null,null,null,null,467,"2017-11-23",{"$f":"Settings!$C$11-((Settings!$C$11-Settings!$E$11)/(Settings!$E$8-Settings!$C$8)*$G472)","v":63.964041095890416},{"$f":"VLOOKUP(H472,data[],2,FALSE)","v":{"$error":"#N/A"}},{"$f":"VLOOKUP(H472,data[],12,FALSE)","v":{"$error":"#N/A"}}]
[null,null,null,null,null,null,468,"2017-11-24",{"$f":"Settings!$C$11-((Settings!$C$11-Settings!$E$11)/(Settings!$E$8-Settings!$C$8)*$G473)","v":63.843835616438362},{"$f":"VLOOKUP(H473,data[],2,FALSE)","v":{"$error":"#N/A"}},{"$f":"VLOOKUP(H473,data[],12,FALSE)","v":{"$error":"#N/A"}}]
[null,null,null,null,null,null,469,"2017-11-25",{"$f":"Settings!$C$11-((Settings!$C$11-Settings!$E$11)/(Settings!$E$8-Settings!$C$8)*$G474)","v":63.723630136986309},{"$f":"VLOOKUP(H474,data[],2,FALSE)","v":{"$error":"#N/A"}},{"$f":"VLOOKUP(H474,data[],12,FALSE)","v":{"$error":"#N/A"}}]
[null,null,null,null,null,null,470,"2017-11-26",{"$f":"Settings!$C$11-((Settings!$C$11-Settings!$E$11)/(Settings!$E$8-Settings!$C$8)*$G475)","v":63.603424657534248},{"$f":"VLOOKUP(H475,data[],2,FALSE)","v":{"$error":"#N/A"}},{"$f":"VLOOKUP(H475,data[],12,FALSE)","v":{"$error":"#N/A"}}]
[null,null,null,null,null,null,471,"2017-11-27",{"$f":"Settings!$C$11-((Settings!$C$11-Settings!$E$11)/(Settings!$E$8-Settings!$C$8)*$G476)","v":63.483219178082194},{"$f":"VLOOKUP(H476,data[],2,FALSE)","v":{"$error":"#N/A"}},{"$f":"VLOOKUP(H476,data[],12,FALSE)","v":{"$error":"#N/A"}}]
[null,null,null,null,null,null,472,"2017-11-28",{"$f":"Settings!$C$11-((Settings!$C$11-Settings!$E$11)/(Settings!$E$8-Settings!$C$8)*$G477)","v":63.363013698630141},{"$f":"VLOOKUP(H477,data[],2,FALSE)","v":{"$error":"#N/A"}},{"$f":"VLOOKUP(H477,data[],12,FALSE)","v":{"$error":"#N/A"}}]
[null,null,null,null,null,null,473,"2017-11-29",{"$f":"Settings!$C$11-((Settings!$C$11-Settings!$E$11)/(Settings!$E$8-Settings!$C$8)*$G478)","v":63.242808219178087},{"$f":"VLOOKUP(H478,data[],2,FALSE)","v":{"$error":"#N/A"}},{"$f":"VLOOKUP(H478,data[],12,FALSE)","v":{"$error":"#N/A"}}]
[null,null,null,null,null,null,474,"2017-11-30",{"$f":"Settings!$C$11-((Settings!$C$11-Settings!$E$11)/(Settings!$E$8-Settings!$C$8)*$G479)","v":63.122602739726034},{"$f":"VLOOKUP(H479,data[],2,FALSE)","v":{"$error":"#N/A"}},{"$f":"VLOOKUP(H479,data[],12,FALSE)","v":{"$error":"#N/A"}}]
[null,null,null,null,null,null,475,"2017-12-01",{"$f":"Settings!$C$11-((Settings!$C$11-Settings!$E$11)/(Settings!$E$8-Settings!$C$8)*$G480)","v":63.00239726027398},{"$f":"VLOOKUP(H480,data[],2,FALSE)","v":{"$error":"#N/A"}},{"$f":"VLOOKUP(H480,data[],12,FALSE)","v":{"$error":"#N/A"}}]
[null,null,null,null,null,null,476,"2017-12-02",{"$f":"Settings!$C$11-((Settings!$C$11-Settings!$E$11)/(Settings!$E$8-Settings!$C$8)*$G481)","v":62.88219178082192},{"$f":"VLOOKUP(H481,data[],2,FALSE)","v":{"$error":"#N/A"}},{"$f":"VLOOKUP(H481,data[],12,FALSE)","v":{"$error":"#N/A"}}]
[null,null,null,null,null,null,477,"2017-12-03",{"$f":"Settings!$C$11-((Settings!$C$11-Settings!$E$11)/(Settings!$E$8-Settings!$C$8)*$G482)","v":62.761986301369866},{"$f":"VLOOKUP(H482,data[],2,FALSE)","v":{"$error":"#N/A"}},{"$f":"VLOOKUP(H482,data[],12,FALSE)","v":{"$error":"#N/A"}}]
[null,null,null,null,null,null,478,"2017-12-04",{"$f":"Settings!$C$11-((Settings!$C$11-Settings!$E$11)/(Settings!$E$8-Settings!$C$8)*$G483)","v":62.641780821917813},{"$f":"VLOOKUP(H483,data[],2,FALSE)","v":{"$error":"#N/A"}},{"$f":"VLOOKUP(H483,data[],12,FALSE)","v":{"$error":"#N/A"}}]
[null,null,null,null,null,null,479,"2017-12-05",{"$f":"Settings!$C$11-((Settings!$C$11-Settings!$E$11)/(Settings!$E$8-Settings!$C$8)*$G484)","v":62.521575342465759},{"$f":"VLOOKUP(H484,data[],2,FALSE)","v":{"$error":"#N/A"}},{"$f":"VLOOKUP(H484,data[],12,FALSE)","v":{"$error":"#N/A"}}]
[null,null,null,null,null,null,480,"2017-12-06",{"$f":"Settings!$C$11-((Settings!$C$11-Settings!$E$11)/(Settings!$E$8-Settings!$C$8)*$G485)","v":62.401369863013706},{"$f":"VLOOKUP(H485,data[],2,FALSE)","v":{"$error":"#N/A"}},{"$f":"VLOOKUP(H485,data[],12,FALSE)","v":{"$error":"#N/A"}}]
[null,null,null,null,null,null,481,"2017-12-07",{"$f":"Settings!$C$11-((Settings!$C$11-Settings!$E$11)/(Settings!$E$8-Settings!$C$8)*$G486)","v":62.281164383561652},{"$f":"VLOOKUP(H486,data[],2,FALSE)","v":{"$error":"#N/A"}},{"$f":"VLOOKUP(H486,data[],12,FALSE)","v":{"$error":"#N/A"}}]
[null,null,null,null,null,null,482,"2017-12-08",{"$f":"Settings!$C$11-((Settings!$C$11-Settings!$E$11)/(Settings!$E$8-Settings!$C$8)*$G487)","v":62.160958904109592},{"$f":"VLOOKUP(H487,data[],2,FALSE)","v":{"$error":"#N/A"}},{"$f":"VLOOKUP(H487,data[],12,FALSE)","v":{"$error":"#N/A"}}]
[null,null,null,null,null,null,483,"2017-12-09",{"$f":"Settings!$C$11-((Settings!$C$11-Settings!$E$11)/(Settings!$E$8-Settings!$C$8)*$G488)","v":62.040753424657538},{"$f":"VLOOKUP(H488,data[],2,FALSE)","v":{"$error":"#N/A"}},{"$f":"VLOOKUP(H488,data[],12,FALSE)","v":{"$error":"#N/A"}}]
[null,null,null,null,null,null,484,"2017-12-10",{"$f":"Settings!$C$11-((Settings!$C$11-Settings!$E$11)/(Settings!$E$8-Settings!$C$8)*$G489)","v":61.920547945205485},{"$f":"VLOOKUP(H489,data[],2,FALSE)","v":{"$error":"#N/A"}},{"$f":"VLOOKUP(H489,data[],12,FALSE)","v":{"$error":"#N/A"}}]
[null,null,null,null,null,null,485,"2017-12-11",{"$f":"Settings!$C$11-((Settings!$C$11-Settings!$E$11)/(Settings!$E$8-Settings!$C$8)*$G490)","v":61.800342465753431},{"$f":"VLOOKUP(H490,data[],2,FALSE)","v":{"$error":"#N/A"}},{"$f":"VLOOKUP(H490,data[],12,FALSE)","v":{"$error":"#N/A"}}]
[null,null,null,null,null,null,486,"2017-12-12",{"$f":"Settings!$C$11-((Settings!$C$11-Settings!$E$11)/(Settings!$E$8-Settings!$C$8)*$G491)","v":61.680136986301378},{"$f":"VLOOKUP(H491,data[],2,FALSE)","v":{"$error":"#N/A"}},{"$f":"VLOOKUP(H491,data[],12,FALSE)","v":{"$error":"#N/A"}}]
[null,null,null,null,null,null,487,"2017-12-13",{"$f":"Settings!$C$11-((Settings!$C$11-Settings!$E$11)/(Settings!$E$8-Settings!$C$8)*$G492)","v":61.559931506849317},{"$f":"VLOOKUP(H492,data[],2,FALSE)","v":{"$error":"#N/A"}},{"$f":"VLOOKUP(H492,data[],12,FALSE)","v":{"$error":"#N/A"}}]
[null,null,null,null,null,null,488,"2017-12-14",{"$f":"Settings!$C$11-((Settings!$C$11-Settings!$E$11)/(Settings!$E$8-Settings!$C$8)*$G493)","v":61.439726027397263},{"$f":"VLOOKUP(H493,data[],2,FALSE)","v":{"$error":"#N/A"}},{"$f":"VLOOKUP(H493,data[],12,FALSE)","v":{"$error":"#N/A"}}]