{"text_format":"1","workbook":"xlsx","n_sheets":4,"sheets":["Summary","Data","Settings","config"],"not_rendered":{"charts":5,"images":11,"macros":1,"external_links":1,"defined_names":20,"comments":0,"pivot_tables":0},"unopened":[],"bounds":{"document_bytes":16777216,"sheet_cells":100000,"rows_first":2000,"rows_last":500,"rows_between":2000,"halvings":0,"cell_chars":16384,"cell_head_chars":4096},"cells_cut":0,"cells_raw":0,"read":"whole","date_system":"1900"}

{"sheet":"Summary","index":0,"n_rows":29,"n_cols":14,"rows_kept":29,"cut":false,"hidden":false,"merged":[[2,9,2,13],[3,9,3,13],[4,9,4,13],[13,13,15,13],[17,1,18,5],[11,9,12,13],[13,9,13,10],[14,9,14,10],[15,9,15,10]]}
[null,"Weight Loss Tracker"]
[]
[null,{"$f":"IF(Settings!C3=\"\",\"\",Settings!C3)","v":"Brian"},"Add New Measurements","Starting Measurements","My Progress\nTo Date","My Goals","Remaining",null,null,"My current Body Mass Index (BMI)"]
[null,"Date:","2017-02-15",{"$f":"IF(Settings!C8=\"\",\"\",Settings!C8)","v":"2016-08-13"},{"$f":"IF(Data!A1=0,\"\",Data!A1)","v":"2017-02-08"},{"$f":"IF(Settings!E8=\"\",\"\",Settings!E8)","v":"2017-06-01"},{"$f":"IFERROR(IF(E4=\"\",\"\",IF(H4=\"days\",F4-E4,(F4-E4)/7)),\"\")","v":113},{"$f":"F20","v":"days"},null,{"$f":"IFERROR(IF(Settings!$F$5=\"Metric\",E7/(D6*D6/10000),E7/(D6*D6)*703),0)","v":38.658157639747401}]
[null,"Measurements",null,"% Body weight loss",{"$f":"IF(OR(E7=\"\",D7=0),\"\",(D7-E7)/D7)","v":3.6636136552872539E-2},{"$f":"IFERROR((D7-F7)/D7,\"\")","v":0.29225645295587005},null,null,null,"BMI = weight / (height x height)"]
[null,{"$f":"Settings!B10","v":"Height (cm):"},null,{"$f":"Settings!C10","v":173},null,null,null,null,null,null,"Less than 18.5","Under weight"]
[null,{"$f":"Settings!B11","v":"Weight (kg):"},null,{"$f":"Settings!C11","v":120.1},{"$f":"Data!B1","v":115.7},{"$f":"Settings!E11","v":85},{"$f":"IF(E7=\"\",\"\",F7-E7)","v":-30.700000000000003},{"$f":"IF(Settings!$F$5=\"Imperial\",\"pounds\",\"kg's\")","v":"kg's"},null,null,"18.5 to 24.9","Healthy"]
[null,{"$f":"Settings!B12","v":"Chest (cm):"},null,{"$f":"Settings!C12","v":110},{"$f":"Data!C1","v":127},{"$f":"Settings!E12","v":105},{"$f":"IF(E8=\"\",\"\",F8-E8)","v":-22},{"$f":"IF(Settings!$F$5=\"Imperial\",\"inches\",\"cm's\")","v":"cm's"},null,null,"25 to 29.9","Over weight"]
[null,{"$f":"Settings!B13","v":"Waist (cm):"},null,{"$f":"Settings!C13","v":107},{"$f":"Data!D1","v":134},{"$f":"Settings!E13","v":97},-37,{"$f":"IF(Settings!$F$5=\"Imperial\",\"inches\",\"cm's\")","v":"cm's"},null,null,"30 to 39.9","Obese"]
[null,{"$f":"Settings!B14","v":"Hips (cm):"},null,{"$f":"Settings!C14","v":105},{"$f":"Data!E1","v":134},{"$f":"Settings!E14","v":102},-32,{"$f":"IF(Settings!$F$5=\"Imperial\",\"inches\",\"cm's\")","v":"cm's"},null,null,"40 and over","Morbidly obese"]
[null,{"$f":"Settings!B15","v":"Neck (cm):"},null,{"$f":"Settings!C15","v":42},{"$f":"Data!F1","v":45},{"$f":"Settings!E15","v":36},-9,{"$f":"IF(Settings!$F$5=\"Imperial\",\"inches\",\"cm's\")","v":"cm's"}]
[null,{"$f":"Settings!B16","v":"Thigh (cm):"},null,{"$f":"Settings!C16","v":55},{"$f":"Data!G1","v":65},{"$f":"Settings!E16","v":50},-15,{"$f":"IF(Settings!$F$5=\"Imperial\",\"inches\",\"cm's\")","v":"cm's"},null,"Estimated Lean Body Weight"]
[null,"Blood Pressure"]
[null,{"$f":"Settings!B18","v":"Systolic (mmHg):"},null,{"$f":"Settings!C18","v":146},{"$f":"Data!M1","v":146},{"$f":"Settings!E18","v":115},{"$f":"IF(E14=\"\",\"\",F14-E14)","v":-31},"mmHg",null,"Estimated Lean Body Weight",null,{"$f":"IF(Data!$D$1=0,\"-\",Data!H1)","v":75.87169999999999},{"$f":"H7","v":"kg's"},{"$f":"IF(Data!$D$1=0,\"Please add your waist measurement for these figures to be calculated\",\"\")","v":""}]
[null,{"$f":"Settings!B19","v":"Diastolic (mmHg):"},null,{"$f":"Settings!C19","v":89},{"$f":"Data!N1","v":89},{"$f":"Settings!E19","v":75},{"$f":"IF(E15=\"\",\"\",F15-E15)","v":-14},"mmHg",null,"Estimated Body Fat Weight",null,{"$f":"IF(Data!$D$1=0,\"-\",Data!I1)","v":44.228300000000004},{"$f":"M14","v":"kg's"}]
{"$rows_left_out":15}
{"sheet":"Data","index":1,"n_rows":6,"n_cols":17,"rows_kept":6,"cut":false,"hidden":false,"merged":[]}
[{"$f":"MAX(data[Date])","v":"2017-02-08"},{"$f":"IFERROR(LOOKUP(2,1/(NOT(ISBLANK(data[Weight]))),data[Weight]),0)","v":115.7},{"$f":"IFERROR(LOOKUP(2,1/(NOT(ISBLANK(data[Chest]))),data[Chest]),0)","v":127},{"$f":"IFERROR(LOOKUP(2,1/(NOT(ISBLANK(data[Waist]))),data[Waist]),0)","v":134},{"$f":"IFERROR(LOOKUP(2,1/(NOT(ISBLANK(data[Hips]))),data[Hips]),0)","v":134},{"$f":"IFERROR(LOOKUP(2,1/(NOT(ISBLANK(data[Neck]))),data[Neck]),0)","v":45},{"$f":"IFERROR(LOOKUP(2,1/(NOT(ISBLANK(data[Thigh]))),data[Thigh]),0)","v":65},{"$f":"VLOOKUP($D1,data[[Waist]:[Goal Weight (kg)]],COLUMNS($D$4:H6),FALSE)","v":75.87169999999999},{"$f":"VLOOKUP($D1,data[[Waist]:[Goal Weight (kg)]],COLUMNS($D$4:I6),FALSE)","v":44.228300000000004},{"$f":"VLOOKUP($D1,data[[Waist]:[Goal Weight (kg)]],COLUMNS($D$4:J6),FALSE)","v":36.826228143213996},{"$f":"VLOOKUP($B1,data[[Weight]:[Goal Weight (kg)]],COLUMNS($B$4:K6),FALSE)","v":38.658157639747401},{"$f":"VLOOKUP($B1,data[[Weight]:[Goal Weight (kg)]],COLUMNS($B$4:L6),FALSE)","v":85},{"$f":"IFERROR(LOOKUP(2,1/(NOT(ISBLANK(data[Systolic (mmHg)]))),data[Systolic (mmHg)]),0)","v":146},{"$f":"IFERROR(LOOKUP(2,1/(NOT(ISBLANK(data[Diastolic (mmHg)]))),data[Diastolic (mmHg)]),0)","v":89},{"$f":"IFERROR(LOOKUP(2,1/(NOT(ISBLANK(data[Pulse (beats/sec)]))),data[Pulse (beats/sec)]),0)","v":82}]
[null,"My Data"]
["Date","Weight","Chest","Waist","Hips","Neck","Thigh","Estimated Lean Body Weight","Estimated Body Fat Weight","Estimated Body Fat Percentage","Estimated Body Mass Index (BMI)","Goal Weight (kg)","Systolic (mmHg)","Diastolic (mmHg)","Pulse (beats/sec)"]
["2016-08-13",120.1,127,134,134,45,65,{"$f":"IF(B4=\"\",0,IF(Settings!$F$5=\"Metric\",IF(Settings!$F$3=\"Male\",B4*0.407+Settings!$C$10*0.267-19.2,B4*0.252+Settings!$C$10*0.473-48.3),IF(Settings!$F$3=\"Male\",B4*0.45359237*0.407+Settings!$C$10*2.54*0.267-19.2,B4*0.45359237*0.252+Settings!$C$10*2.54*0.473-48.3)))","v":75.87169999999999},{"$f":"IF(OR(B4=\"\",H4=0),0,B4-H4)","v":44.228300000000004},{"$f":"IF(I4=0,0,(I4*100)/B4)","v":36.826228143213996},{"$f":"B4/(Summary!$D$6^2/10000)","v":40.128303651976339},{"$f":"Summary!$F$7","v":85},146,89,84,null,"DO NOT Delete this row"]
["2016-09-02",118.3,null,null,null,null,null,{"$f":"IF(B5=\"\",0,IF(Settings!$F$5=\"Metric\",IF(Settings!$F$3=\"Male\",B5*0.407+Settings!$C$10*0.267-19.2,B5*0.252+Settings!$C$10*0.473-48.3),IF(Settings!$F$3=\"Male\",B5*0.45359237*0.407+Settings!$C$10*2.54*0.267-19.2,B5*0.45359237*0.252+Settings!$C$10*2.54*0.473-48.3)))","v":75.139099999999999},{"$f":"IF(OR(B5=\"\",H5=0),0,B5-H5)","v":43.160899999999998},{"$f":"IF(I5=0,0,(I5*100)/B5)","v":36.48427726120034},{"$f":"B5/(Summary!$D$6^2/10000)","v":39.526880283337228},{"$f":"Summary!$F$7","v":85},146,89,82]
["2017-02-08",115.7,null,null,null,null,null,{"$f":"IF(B6=\"\",0,IF(Settings!$F$5=\"Metric\",IF(Settings!$F$3=\"Male\",B6*0.407+Settings!$C$10*0.267-19.2,B6*0.252+Settings!$C$10*0.473-48.3),IF(Settings!$F$3=\"Male\",B6*0.45359237*0.407+Settings!$C$10*2.54*0.267-19.2,B6*0.45359237*0.252+Settings!$C$10*2.54*0.473-48.3)))","v":74.0809},{"$f":"IF(OR(B6=\"\",H6=0),0,B6-H6)","v":41.619100000000003},{"$f":"IF(I6=0,0,(I6*100)/B6)","v":35.971564390665513},{"$f":"B6/(Summary!$D$6^2/10000)","v":38.658157639747401},{"$f":"Summary!$F$7","v":85}]

{"sheet":"Settings","index":2,"n_rows":20,"n_cols":7,"rows_kept":20,"cut":false,"hidden":false,"merged":[[2,5,2,6],[4,5,4,6],[6,1,6,2]]}
[null,"Settings"]
[]
[null,"Name:","Brian",null,"Sex:","Male"]
[]
[null,"Date of Birth:","1969-10-14",null,"Measurements:","Metric"]
[]
[null,"Starting Measurements",null,null,"My Goal Measurements",null,"To Meet\nMy Goal"]
[null,"Date:","2016-08-13",null,"2017-06-01",null,{"$f":"IF(OR(C8=\"\",E8=\"\"),\"\",E8-C8)","v":292}]
[null,null,"Measurements"]
[null,{"$f":"IF($F$5=\"Imperial\",\"Height (inches):\",\"Height (cm):\")","v":"Height (cm):"},173]
[null,{"$f":"IF($F$5=\"Imperial\",\"Weight (pounds):\",\"Weight (kg):\")","v":"Weight (kg):"},120.1,null,85,null,{"$f":"IF(C11=\"\",\"\",E11-C11)","v":-35.099999999999994}]
[null,{"$f":"IF($F$5=\"Imperial\",\"Chest (inches):\",\"Chest (cm):\")","v":"Chest (cm):"},110,null,105,null,{"$f":"IF(C12=\"\",\"\",E12-C12)","v":-5}]
[null,{"$f":"IF($F$5=\"Imperial\",\"Waist (inches):\",\"Waist (cm):\")","v":"Waist (cm):"},107,null,97,null,-10]
[null,{"$f":"IF($F$5=\"Imperial\",\"Hips (inches):\",\"Hips (cm):\")","v":"Hips (cm):"},105,null,102,null,-3]
[null,{"$f":"IF($F$5=\"Imperial\",\"Neck (inches):\",\"Neck (cm):\")","v":"Neck (cm):"},42,null,36,null,-6]
{"$rows_left_out":6}
{"sheet":"config","index":3,"n_rows":493,"n_cols":30,"rows_kept":493,"cut":false,"hidden":true,"merged":[]}
[null,"Configuration settings"]
[]
[null,null,null,null,null,null,"Dashboard Graph Data",null,null,null,null,null,null,null,null,null,null,null,null,null,null,null,null,null,null,null,null,{"$f":"Data!M1","v":146},{"$f":"Data!N1","v":89}]
[null,null,null,null,null,null,null,"Date","Weight Loss Goal","Actual Weight Loss ","Goal Weight (kg)",null,{"$f":"IF(Settings!$F$5=\"Metric\",\"cm\",\"inch\")","v":"cm"},18.5,25,30,40,"40+","My BMI","BMI Label",null,"Blood Pressure","Low","Normal","PreHypertension","High Stage 1","High Stage 2","Hypertensive Crisis","My BP","BP Label"]
[null,"Sex",null,"Time",null,null,0,{"$f":"Settings!C8","v":"2016-08-13"},{"$f":"Settings!C11","v":120.1},{"$f":"Settings!C11","v":120.1},{"$f":"Settings!E11","v":85},null,{"$f":"IF(Settings!$F$5=\"Metric\",140,55)","v":140},{"$f":"IF(Settings!$F$5=\"Metric\",N$4*$M5*$M5/10000,N$4*$M5*$M5/703)","v":36.26},{"$f":"IF(Settings!$F$5=\"Metric\",O$4*$M5*$M5/10000,O$4*$M5*$M5/703)","v":49},{"$f":"IF(Settings!$F$5=\"Metric\",P$4*$M5*$M5/10000,P$4*$M5*$M5/703)","v":58.8},{"$f":"IF(Settings!$F$5=\"Metric\",Q$4*$M5*$M5/10000,Q$4*$M5*$M5/703)","v":78.400000000000006},{"$f":"Q40+10","v":186.4},{"$f":"IF(AND(Settings!$C$10>=config!M5,Settings!$C$10<config!M6),Data!$B$1,NA())","v":{"$error":"#N/A"}},{"$f":"IF(ISERROR(S5),NA(),\"My current BMI: \"&TEXT(Summary!$J$4,\"0.0\"))","v":{"$error":"#N/A"}},null,40,90,120,140,160,180,200,{"$f":"IF(AND($AC$3>=config!V5,$AC$3<config!V6),$AB$3,NA())","v":{"$error":"#N/A"}},{"$f":"IF(ISERROR(AC5),NA(),\"My current BP: \"&TEXT($AB$3,\"0\")&\"/\"&TEXT($AC$3,\"0\"))","v":{"$error":"#N/A"}}]
[null,"Male",null,"days",null,null,{"$f":"G5+1","v":1},{"$f":"H5+1","v":"2016-08-14"},{"$f":"Settings!$C$11-((Settings!$C$11-Settings!$E$11)/(Settings!$E$8-Settings!$C$8)*$G6)","v":119.97979452054794},{"$f":"VLOOKUP(H6,data[],2,FALSE)","v":{"$error":"#N/A"}},{"$f":"VLOOKUP(H6,data[],12,FALSE)","v":{"$error":"#N/A"}},null,{"$f":"IF(Settings!$F$5=\"Metric\",M5+2,M5+1)","v":142},{"$f":"IF(Settings!$F$5=\"Metric\",N$4*$M6*$M6/10000,N$4*$M6*$M6/703)","v":37.303400000000003},{"$f":"IF(Settings!$F$5=\"Metric\",O$4*$M6*$M6/10000,O$4*$M6*$M6/703)","v":50.41},{"$f":"IF(Settings!$F$5=\"Metric\",P$4*$M6*$M6/10000,P$4*$M6*$M6/703)","v":60.491999999999997},{"$f":"IF(Settings!$F$5=\"Metric\",Q$4*$M6*$M6/10000,Q$4*$M6*$M6/703)","v":80.656000000000006},{"$f":"R5","v":186.4},{"$f":"IF(AND(Settings!$C$10>=config!M6,Settings!$C$10<config!M7),Data!$B$1,NA())","v":{"$error":"#N/A"}},{"$f":"IF(ISERROR(S6),NA(),\"My current BMI: \"&TEXT(Summary!$J$4,\"0.0\"))","v":{"$error":"#N/A"}},null,{"$f":"V5+1","v":41},90,120,140,160,180,200,{"$f":"IF(AND($AC$3>=config!V6,$AC$3<config!V7),$AB$3,NA())","v":{"$error":"#N/A"}},{"$f":"IF(ISERROR(AC6),NA(),\"My current BP: \"&TEXT($AB$3,\"0\")&\"/\"&TEXT($AC$3,\"0\"))","v":{"$error":"#N/A"}}]
[null,"Female",null,"weeks",null,null,2,"2016-08-15",{"$f":"Settings!$C$11-((Settings!$C$11-Settings!$E$11)/(Settings!$E$8-Settings!$C$8)*$G7)","v":119.85958904109589},{"$f":"VLOOKUP(H7,data[],2,FALSE)","v":{"$error":"#N/A"}},{"$f":"VLOOKUP(H7,data[],12,FALSE)","v":{"$error":"#N/A"}},null,{"$f":"IF(Settings!$F$5=\"Metric\",M6+2,M6+1)","v":144},{"$f":"IF(Settings!$F$5=\"Metric\",N$4*$M7*$M7/10000,N$4*$M7*$M7/703)","v":38.361600000000003},{"$f":"IF(Settings!$F$5=\"Metric\",O$4*$M7*$M7/10000,O$4*$M7*$M7/703)","v":51.84},{"$f":"IF(Settings!$F$5=\"Metric\",P$4*$M7*$M7/10000,P$4*$M7*$M7/703)","v":62.207999999999998},{"$f":"IF(Settings!$F$5=\"Metric\",Q$4*$M7*$M7/10000,Q$4*$M7*$M7/703)","v":82.944000000000003},{"$f":"R6","v":186.4},{"$f":"IF(AND(Settings!$C$10>=config!M7,Settings!$C$10<config!M8),Data!$B$1,NA())","v":{"$error":"#N/A"}},{"$f":"IF(ISERROR(S7),NA(),\"My current BMI: \"&TEXT(Summary!$J$4,\"0.0\"))","v":{"$error":"#N/A"}},null,{"$f":"V6+1","v":42},90,120,140,160,180,200,{"$f":"IF(AND($AC$3>=config!V7,$AC$3<config!V8),$AB$3,NA())","v":{"$error":"#N/A"}},{"$error":"#N/A"}]
[null,null,null,null,null,null,3,"2016-08-16",{"$f":"Settings!$C$11-((Settings!$C$11-Settings!$E$11)/(Settings!$E$8-Settings!$C$8)*$G8)","v":119.73938356164383},{"$f":"VLOOKUP(H8,data[],2,FALSE)","v":{"$error":"#N/A"}},{"$f":"VLOOKUP(H8,data[],12,FALSE)","v":{"$error":"#N/A"}},null,{"$f":"IF(Settings!$F$5=\"Metric\",M7+2,M7+1)","v":146},{"$f":"IF(Settings!$F$5=\"Metric\",N$4*$M8*$M8/10000,N$4*$M8*$M8/703)","v":39.434600000000003},{"$f":"IF(Settings!$F$5=\"Metric\",O$4*$M8*$M8/10000,O$4*$M8*$M8/703)","v":53.29},{"$f":"IF(Settings!$F$5=\"Metric\",P$4*$M8*$M8/10000,P$4*$M8*$M8/703)","v":63.948},{"$f":"IF(Settings!$F$5=\"Metric\",Q$4*$M8*$M8/10000,Q$4*$M8*$M8/703)","v":85.263999999999996},186.4,{"$f":"IF(AND(Settings!$C$10>=config!M8,Settings!$C$10<config!M9),Data!$B$1,NA())","v":{"$error":"#N/A"}},{"$f":"IF(ISERROR(S8),NA(),\"My current BMI: \"&TEXT(Summary!$J$4,\"0.0\"))","v":{"$error":"#N/A"}},null,43,90,120,140,160,180,200,{"$f":"IF(AND($AC$3>=config!V8,$AC$3<config!V9),$AB$3,NA())","v":{"$error":"#N/A"}},{"$error":"#N/A"}]
[null,"Measurements",null,null,null,null,4,"2016-08-17",{"$f":"Settings!$C$11-((Settings!$C$11-Settings!$E$11)/(Settings!$E$8-Settings!$C$8)*$G9)","v":119.61917808219178},{"$f":"VLOOKUP(H9,data[],2,FALSE)","v":{"$error":"#N/A"}},{"$f":"VLOOKUP(H9,data[],12,FALSE)","v":{"$error":"#N/A"}},null,{"$f":"IF(Settings!$F$5=\"Metric\",M8+2,M8+1)","v":148},{"$f":"IF(Settings!$F$5=\"Metric\",N$4*$M9*$M9/10000,N$4*$M9*$M9/703)","v":40.522399999999998},{"$f":"IF(Settings!$F$5=\"Metric\",O$4*$M9*$M9/10000,O$4*$M9*$M9/703)","v":54.76},{"$f":"IF(Settings!$F$5=\"Metric\",P$4*$M9*$M9/10000,P$4*$M9*$M9/703)","v":65.712000000000003},{"$f":"IF(Settings!$F$5=\"Metric\",Q$4*$M9*$M9/10000,Q$4*$M9*$M9/703)","v":87.616},186.4,{"$f":"IF(AND(Settings!$C$10>=config!M9,Settings!$C$10<config!M10),Data!$B$1,NA())","v":{"$error":"#N/A"}},{"$f":"IF(ISERROR(S9),NA(),\"My current BMI: \"&TEXT(Summary!$J$4,\"0.0\"))","v":{"$error":"#N/A"}},null,44,90,120,140,160,180,200,{"$f":"IF(AND($AC$3>=config!V9,$AC$3<config!V10),$AB$3,NA())","v":{"$error":"#N/A"}},{"$error":"#N/A"}]
[null,"Metric",null,null,null,null,5,"2016-08-18",{"$f":"Settings!$C$11-((Settings!$C$11-Settings!$E$11)/(Settings!$E$8-Settings!$C$8)*$G10)","v":119.49897260273973},{"$f":"VLOOKUP(H10,data[],2,FALSE)","v":{"$error":"#N/A"}},{"$f":"VLOOKUP(H10,data[],12,FALSE)","v":{"$error":"#N/A"}},null,{"$f":"IF(Settings!$F$5=\"Metric\",M9+2,M9+1)","v":150},{"$f":"IF(Settings!$F$5=\"Metric\",N$4*$M10*$M10/10000,N$4*$M10*$M10/703)","v":41.625},{"$f":"IF(Settings!$F$5=\"Metric\",O$4*$M10*$M10/10000,O$4*$M10*$M10/703)","v":56.25},{"$f":"IF(Settings!$F$5=\"Metric\",P$4*$M10*$M10/10000,P$4*$M10*$M10/703)","v":67.5},{"$f":"IF(Settings!$F$5=\"Metric\",Q$4*$M10*$M10/10000,Q$4*$M10*$M10/703)","v":90},186.4,{"$f":"IF(AND(Settings!$C$10>=config!M10,Settings!$C$10<config!M11),Data!$B$1,NA())","v":{"$error":"#N/A"}},{"$f":"IF(ISERROR(S10),NA(),\"My current BMI: \"&TEXT(Summary!$J$4,\"0.0\"))","v":{"$error":"#N/A"}},null,45,90,120,140,160,180,200,{"$f":"IF(AND($AC$3>=config!V10,$AC$3<config!V11),$AB$3,NA())","v":{"$error":"#N/A"}},{"$error":"#N/A"}]
[null,"Imperial",null,null,null,null,6,"2016-08-19",{"$f":"Settings!$C$11-((Settings!$C$11-Settings!$E$11)/(Settings!$E$8-Settings!$C$8)*$G11)","v":119.37876712328766},{"$f":"VLOOKUP(H11,data[],2,FALSE)","v":{"$error":"#N/A"}},{"$f":"VLOOKUP(H11,data[],12,FALSE)","v":{"$error":"#N/A"}},null,{"$f":"IF(Settings!$F$5=\"Metric\",M10+2,M10+1)","v":152},{"$f":"IF(Settings!$F$5=\"Metric\",N$4*$M11*$M11/10000,N$4*$M11*$M11/703)","v":42.742400000000004},{"$f":"IF(Settings!$F$5=\"Metric\",O$4*$M11*$M11/10000,O$4*$M11*$M11/703)","v":57.76},{"$f":"IF(Settings!$F$5=\"Metric\",P$4*$M11*$M11/10000,P$4*$M11*$M11/703)","v":69.311999999999998},{"$f":"IF(Settings!$F$5=\"Metric\",Q$4*$M11*$M11/10000,Q$4*$M11*$M11/703)","v":92.415999999999997},186.4,{"$f":"IF(AND(Settings!$C$10>=config!M11,Settings!$C$10<config!M12),Data!$B$1,NA())","v":{"$error":"#N/A"}},{"$f":"IF(ISERROR(S11),NA(),\"My current BMI: \"&TEXT(Summary!$J$4,\"0.0\"))","v":{"$error":"#N/A"}},null,46,90,120,140,160,180,200,{"$f":"IF(AND($AC$3>=config!V11,$AC$3<config!V12),$AB$3,NA())","v":{"$error":"#N/A"}},{"$error":"#N/A"}]
[null,null,null,null,null,null,7,"2016-08-20",{"$f":"Settings!$C$11-((Settings!$C$11-Settings!$E$11)/(Settings!$E$8-Settings!$C$8)*$G12)","v":119.25856164383561},{"$f":"VLOOKUP(H12,data[],2,FALSE)","v":{"$error":"#N/A"}},{"$f":"VLOOKUP(H12,data[],12,FALSE)","v":{"$error":"#N/A"}},null,{"$f":"IF(Settings!$F$5=\"Metric\",M11+2,M11+1)","v":154},{"$f":"IF(Settings!$F$5=\"Metric\",N$4*$M12*$M12/10000,N$4*$M12*$M12/703)","v":43.874600000000001},{"$f":"IF(Settings!$F$5=\"Metric\",O$4*$M12*$M12/10000,O$4*$M12*$M12/703)","v":59.29},{"$f":"IF(Settings!$F$5=\"Metric\",P$4*$M12*$M12/10000,P$4*$M12*$M12/703)","v":71.147999999999996},{"$f":"IF(Settings!$F$5=\"Metric\",Q$4*$M12*$M12/10000,Q$4*$M12*$M12/703)","v":94.864000000000004},186.4,{"$f":"IF(AND(Settings!$C$10>=config!M12,Settings!$C$10<config!M13),Data!$B$1,NA())","v":{"$error":"#N/A"}},{"$f":"IF(ISERROR(S12),NA(),\"My current BMI: \"&TEXT(Summary!$J$4,\"0.0\"))","v":{"$error":"#N/A"}},null,47,90,120,140,160,180,200,{"$f":"IF(AND($AC$3>=config!V12,$AC$3<config!V13),$AB$3,NA())","v":{"$error":"#N/A"}},{"$error":"#N/A"}]
[null,null,null,null,null,null,8,"2016-08-21",{"$f":"Settings!$C$11-((Settings!$C$11-Settings!$E$11)/(Settings!$E$8-Settings!$C$8)*$G13)","v":119.13835616438355},{"$f":"VLOOKUP(H13,data[],2,FALSE)","v":{"$error":"#N/A"}},{"$f":"VLOOKUP(H13,data[],12,FALSE)","v":{"$error":"#N/A"}},null,{"$f":"IF(Settings!$F$5=\"Metric\",M12+2,M12+1)","v":156},{"$f":"IF(Settings!$F$5=\"Metric\",N$4*$M13*$M13/10000,N$4*$M13*$M13/703)","v":45.021599999999999},{"$f":"IF(Settings!$F$5=\"Metric\",O$4*$M13*$M13/10000,O$4*$M13*$M13/703)","v":60.84},{"$f":"IF(Settings!$F$5=\"Metric\",P$4*$M13*$M13/10000,P$4*$M13*$M13/703)","v":73.007999999999996},{"$f":"IF(Settings!$F$5=\"Metric\",Q$4*$M13*$M13/10000,Q$4*$M13*$M13/703)","v":97.343999999999994},186.4,{"$f":"IF(AND(Settings!$C$10>=config!M13,Settings!$C$10<config!M14),Data!$B$1,NA())","v":{"$error":"#N/A"}},{"$f":"IF(ISERROR(S13),NA(),\"My current BMI: \"&TEXT(Summary!$J$4,\"0.0\"))","v":{"$error":"#N/A"}},null,48,90,120,140,160,180,200,{"$f":"IF(AND($AC$3>=config!V13,$AC$3<config!V14),$AB$3,NA())","v":{"$error":"#N/A"}},{"$error":"#N/A"}]
[null,null,null,null,null,null,9,"2016-08-22",{"$f":"Settings!$C$11-((Settings!$C$11-Settings!$E$11)/(Settings!$E$8-Settings!$C$8)*$G14)","v":119.0181506849315},{"$f":"VLOOKUP(H14,data[],2,FALSE)","v":{"$error":"#N/A"}},{"$f":"VLOOKUP(H14,data[],12,FALSE)","v":{"$error":"#N/A"}},null,{"$f":"IF(Settings!$F$5=\"Metric\",M13+2,M13+1)","v":158},{"$f":"IF(Settings!$F$5=\"Metric\",N$4*$M14*$M14/10000,N$4*$M14*$M14/703)","v":46.183399999999999},{"$f":"IF(Settings!$F$5=\"Metric\",O$4*$M14*$M14/10000,O$4*$M14*$M14/703)","v":62.41},{"$f":"IF(Settings!$F$5=\"Metric\",P$4*$M14*$M14/10000,P$4*$M14*$M14/703)","v":74.891999999999996},{"$f":"IF(Settings!$F$5=\"Metric\",Q$4*$M14*$M14/10000,Q$4*$M14*$M14/703)","v":99.855999999999995},186.4,{"$f":"IF(AND(Settings!$C$10>=config!M14,Settings!$C$10<config!M15),Data!$B$1,NA())","v":{"$error":"#N/A"}},{"$f":"IF(ISERROR(S14),NA(),\"My current BMI: \"&TEXT(Summary!$J$4,\"0.0\"))","v":{"$error":"#N/A"}},null,49,90,120,140,160,180,200,{"$f":"IF(AND($AC$3>=config!V14,$AC$3<config!V15),$AB$3,NA())","v":{"$error":"#N/A"}},{"$error":"#N/A"}]
[null,null,null,null,null,null,10,"2016-08-23",{"$f":"Settings!$C$11-((Settings!$C$11-Settings!$E$11)/(Settings!$E$8-Settings!$C$8)*$G15)","v":118.89794520547945},{"$f":"VLOOKUP(H15,data[],2,FALSE)","v":{"$error":"#N/A"}},{"$f":"VLOOKUP(H15,data[],12,FALSE)","v":{"$error":"#N/A"}},null,{"$f":"IF(Settings!$F$5=\"Metric\",M14+2,M14+1)","v":160},{"$f":"IF(Settings!$F$5=\"Metric\",N$4*$M15*$M15/10000,N$4*$M15*$M15/703)","v":47.36},{"$f":"IF(Settings!$F$5=\"Metric\",O$4*$M15*$M15/10000,O$4*$M15*$M15/703)","v":64},{"$f":"IF(Settings!$F$5=\"Metric\",P$4*$M15*$M15/10000,P$4*$M15*$M15/703)","v":76.8},{"$f":"IF(Settings!$F$5=\"Metric\",Q$4*$M15*$M15/10000,Q$4*$M15*$M15/703)","v":102.4},186.4,{"$f":"IF(AND(Settings!$C$10>=config!M15,Settings!$C$10<config!M16),Data!$B$1,NA())","v":{"$error":"#N/A"}},{"$f":"IF(ISERROR(S15),NA(),\"My current BMI: \"&TEXT(Summary!$J$4,\"0.0\"))","v":{"$error":"#N/A"}},null,50,90,120,140,160,180,200,{"$f":"IF(AND($AC$3>=config!V15,$AC$3<config!V16),$AB$3,NA())","v":{"$error":"#N/A"}},{"$error":"#N/A"}]
{"$rows_left_out":478}